program: Orca
programVersion: 4.2.1
elementType: S O N C C C C C C C C C C C H H H H H H H H H H H H H H H H H H H
charge: 0
multiplicity: 1
keywords: wb97x-d3
keywords: def2-TZVPP
keywords: def2/J RIJCOSX GRIDX6 NOFINALGRIDX
keywords: grid4 nofinalgrid
keywords: scfconv7
keywords: smallprint printgap noloewdin
keywords: NOSOSCF
formula: C11H19NOS
InChI: InChI=1/C11H19NOS/c1-2-3-4-5-6-7-9-12-11(13)8-10-14-12/h8,10H,2-7,9H2,1H3
33 atoms
S  -1.268347 1.019014 0.966927
O  -2.727645 -0.278562 -2.254852
N  -1.826893 -0.127389 -0.151235
C  2.093864 -2.086144 -0.702361
C  0.615306 -1.765707 -0.916028
C  2.801649 -1.228989 0.347159
C  -0.247655 -1.982213 0.319881
C  2.761085 0.2670 0.055036
C  -1.694799 -1.54517 0.140334
C  3.551476 1.119868 1.043737
C  2.980884 1.115784 2.454957
C  -2.293052 0.397847 -1.331024
C  -2.179233 1.848898 -1.268305
C  -1.652331 2.289229 -0.116264
H  2.613401 -1.973531 -1.659226
H  2.197908 -3.140725 -0.427294
H  0.232734 -2.392974 -1.726828
H  0.514527 -0.735325 -1.268751
H  3.847241 -1.549785 0.404388
H  2.379685 -1.430999 1.335765
H  0.179488 -1.470967 1.187906
H  -0.260515 -3.044106 0.581703
H  1.724672 0.619751 0.046269
H  3.146876 0.4402 -0.955399
H  -2.278979 -1.78293 1.031946
H  -2.156311 -2.072293 -0.694379
H  4.593264 0.784292 1.067999
H  3.575517 2.149833 0.676548
H  3.025568 0.129138 2.918332
H  3.529178 1.800069 3.104569
H  1.93504 1.43164 2.457619
H  -2.488872 2.485499 -2.082942
H  -1.46166 3.311305 0.177087
elementType: S O N C H
totalener: -958.86244963 hartree
nucrepener: 1052.58999395 hartree
electener: -2011.45244358 hartree
oneelecener: -3399.45953292 hartree
twoeener: 1388.00708935 hartree
cpcmener: -0.02054140 hartree
kineticenergy: 955.51066213 hartree
xcener: -75.347545356689 hartree
chargesum: -0.0000000
charge: 0.100527 -0.545547 -0.063145 -0.162951 -0.123213 -0.133088 -0.135599 -0.108119 -0.090416 -0.109909 -0.270918 0.304518 -0.262312 -0.056792 0.076614 0.075185 0.088316 0.068318 0.077708 0.064409 0.070936 0.087214 0.037820 0.077917 0.131056 0.102081 0.054540 0.069601 0.079007 0.095120 0.068701 0.159550 0.172870
qa: 0.1005 -0.5455 -0.0631 -0.1630 -0.1232 -0.1331 -0.1356 -0.1081 -0.0904 -0.1099 -0.2709 0.3045 -0.2623 -0.0568 0.0766 0.0752 0.0883 0.0683 0.0777 0.0644 0.0709 0.0872 0.0378 0.0779 0.1311 0.1021 0.0545 0.0696 0.0790 0.0951 0.0687 0.1596 0.1729
va: 2.5439 1.9686 3.0640 3.9276 3.8309 3.8430 3.8571 3.8597 3.8241 3.8963 3.9279 4.2175 3.9031 3.9652 1.0075 1.0080 1.0138 1.0081 1.0113 1.0029 1.0035 1.0202 1.0244 1.0140 0.9996 1.0304 1.0097 1.0058 0.9990 1.0053 1.0059 0.9988 0.9845
dispcorr: -0.015033275 hartree
energy: -958.877482900853
dipole: 23.62656 -22.62724 0.99932 -6.16839 6.88571 0.71732 5.78511 -4.08318 1.70193
magnitude: 2.09994 au
magnitude: 5.33762 debye
