program: Orca
programVersion: 4.2.1
elementType: S O N C C C C C C C C C C C H H H H H H H H H H H H H H H H H H H
charge: 0
multiplicity: 1
keywords: wb97x-d3
keywords: def2-TZVPP
keywords: def2/J RIJCOSX GRIDX6 NOFINALGRIDX
keywords: grid4 nofinalgrid
keywords: scfconv7
keywords: smallprint printgap noloewdin
keywords: NOSOSCF
formula: C11H19NOS
InChI: InChI=1/C11H19NOS/c1-2-3-4-5-6-7-9-12-11(13)8-10-14-12/h8,10H,2-7,9H2,1H3
33 atoms
S  -1.197556 0.798144 0.890661
O  -3.367971 -0.247709 -1.999225
N  -1.932012 -0.249367 -0.219618
C  1.42636 -1.831507 0.455529
C  0.840631 -1.442102 -0.898114
C  2.847887 -1.328282 0.691294
C  -0.522199 -2.063182 -1.188255
C  2.974415 0.188503 0.777479
C  -1.638511 -1.673829 -0.228439
C  4.382979 0.649393 1.132409
C  4.509051 2.162971 1.212347
C  -2.764674 0.360694 -1.12264
C  -2.790929 1.78794 -0.840167
C  -2.006532 2.135214 0.192332
H  1.418122 -2.923372 0.539772
H  0.789957 -1.467825 1.270029
H  1.531262 -1.763019 -1.684376
H  0.776999 -0.354371 -0.99139
H  3.503318 -1.70546 -0.101625
H  3.221194 -1.765821 1.622965
H  -0.44152 -3.154147 -1.157483
H  -0.83097 -1.809427 -2.205371
H  2.271969 0.567296 1.528634
H  2.677382 0.647055 -0.170929
H  -1.414335 -1.983636 0.793068
H  -2.558967 -2.18824 -0.505732
H  4.678079 0.207892 2.089689
H  5.090141 0.263667 0.391165
H  3.839735 2.579018 1.968397
H  5.524089 2.468613 1.471359
H  4.25865 2.633899 0.259497
H  -3.387311 2.478779 -1.416472
H  -1.847133 3.122925 0.599859
elementType: S O N C H
totalener: -958.86400654 hartree
nucrepener: 1027.80669751 hartree
electener: -1986.67070405 hartree
oneelecener: -3349.82226276 hartree
twoeener: 1363.15155872 hartree
cpcmener: -0.02079686 hartree
kineticenergy: 955.51100936 hartree
xcener: -75.345526345059 hartree
chargesum: 0.0000000
charge: 0.104086 -0.552809 -0.048274 -0.130329 -0.152353 -0.131406 -0.115411 -0.094483 -0.124459 -0.088837 -0.275603 0.328064 -0.279810 -0.056045 0.083684 0.057902 0.082290 0.071554 0.061875 0.070862 0.077676 0.084755 0.047855 0.057070 0.126631 0.109622 0.055137 0.055347 0.076422 0.090390 0.077110 0.158512 0.172975
qa: 0.1041 -0.5528 -0.0483 -0.1303 -0.1524 -0.1314 -0.1154 -0.0945 -0.1245 -0.0888 -0.2756 0.3281 -0.2798 -0.0560 0.0837 0.0579 0.0823 0.0716 0.0619 0.0709 0.0777 0.0848 0.0479 0.0571 0.1266 0.1096 0.0551 0.0553 0.0764 0.0904 0.0771 0.1585 0.1730
va: 2.5615 1.9597 3.0450 3.8730 3.8738 3.9001 3.8501 3.8546 3.8711 3.8939 3.9436 4.1987 3.9305 3.9861 1.0151 1.0058 1.0143 1.0045 1.0102 1.0102 1.0158 1.0222 1.0105 1.0091 0.9923 1.0243 1.0076 1.0062 1.0006 1.0045 1.0016 0.9990 0.9850
dispcorr: -0.013785766 hartree
energy: -958.877792304324
dipole: 27.51166 -26.15629 1.35536 -4.02583 4.60295 0.57712 3.97562 -2.42777 1.54784
magnitude: 2.13679 au
magnitude: 5.43130 debye
