program: Orca
programVersion: 4.2.1
elementType: S O N C C C C C C C C C C C H H H H H H H H H H H H H H H H H H H
charge: 0
multiplicity: 1
keywords: wb97x-d3
keywords: def2-TZVPP
keywords: def2/J RIJCOSX GRIDX6 NOFINALGRIDX
keywords: grid4 nofinalgrid
keywords: scfconv7
keywords: smallprint printgap noloewdin
keywords: NOSOSCF
formula: C11H19NOS
InChI: InChI=1/C11H19NOS/c1-2-3-4-5-6-7-9-12-11(13)8-10-14-12/h8,10H,2-7,9H2,1H3
33 atoms
S  -1.65487 0.670642 1.179281
O  -1.709988 0.263393 -2.563798
N  -1.769501 -0.134119 -0.307615
C  1.95499 -2.317789 -0.131437
C  0.612798 -2.049827 -0.813908
C  2.423841 -1.173413 0.769097
C  -0.573558 -2.259937 0.123471
C  2.951697 0.0269 -0.011505
C  -1.85794 -1.583395 -0.336196
C  3.366922 1.211496 0.857542
C  2.199041 1.931407 1.518339
C  -1.667595 0.676885 -1.412093
C  -1.508414 2.052814 -0.961982
C  -1.482074 2.173055 0.373475
H  2.72226 -2.508348 -0.887972
H  1.878301 -3.239557 0.453837
H  0.496711 -2.705533 -1.680919
H  0.607412 -1.032059 -1.213201
H  3.218553 -1.535869 1.428418
H  1.606952 -0.867032 1.430297
H  -0.330104 -1.912766 1.132913
H  -0.776846 -3.329228 0.22305
H  2.203041 0.368108 -0.73417
H  3.812263 -0.30062 -0.603644
H  -2.698808 -1.897621 0.284942
H  -2.10141 -1.86063 -1.361412
H  4.074091 0.87514 1.622524
H  3.914002 1.927505 0.238199
H  1.637407 1.28086 2.189797
H  2.543021 2.783675 2.10697
H  1.499985 2.310716 0.769917
H  -1.415937 2.875884 -1.654439
H  -1.374692 3.076595 0.955679
elementType: S O N C H
totalener: -958.86166734 hartree
nucrepener: 1065.56496732 hartree
electener: -2024.42663466 hartree
oneelecener: -3425.53832301 hartree
twoeener: 1401.11168835 hartree
cpcmener: -0.02025885 hartree
kineticenergy: 955.51078153 hartree
xcener: -75.346250297301 hartree
chargesum: -0.0000000
charge: 0.113567 -0.545404 -0.055962 -0.148731 -0.126837 -0.123564 -0.147478 -0.122667 -0.083861 -0.103552 -0.274134 0.290280 -0.249326 -0.083892 0.074311 0.077458 0.090656 0.060737 0.078249 0.054055 0.073210 0.089507 0.061606 0.072099 0.129774 0.100016 0.052885 0.069941 0.068533 0.097696 0.073485 0.158087 0.179258
qa: 0.1136 -0.5454 -0.0560 -0.1487 -0.1268 -0.1236 -0.1475 -0.1227 -0.0839 -0.1036 -0.2741 0.2903 -0.2493 -0.0839 0.0743 0.0775 0.0907 0.0607 0.0782 0.0541 0.0732 0.0895 0.0616 0.0721 0.1298 0.1000 0.0529 0.0699 0.0685 0.0977 0.0735 0.1581 0.1793
va: 2.5476 1.9641 3.0716 3.9161 3.8444 3.8647 3.8715 3.8640 3.8290 3.8972 3.9328 4.2253 3.8958 3.9864 1.0075 1.0054 1.0103 1.0153 1.0120 1.0086 1.0055 1.0182 1.0090 1.0118 1.0006 1.0277 1.0084 1.0053 1.0039 1.0068 1.0007 0.9994 0.9818
dispcorr: -0.015834018 hartree
energy: -958.877501361867
dipole: 20.73362 -20.50581 0.22781 -5.55095 5.75958 0.20863 4.59393 -2.52666 2.06727
magnitude: 2.09022 au
magnitude: 5.31291 debye
