program: Orca
programVersion: 4.2.1
elementType: S O N C C C C C C C C C C C H H H H H H H H H H H H H H H H H H H
charge: 0
multiplicity: 1
keywords: wb97x-d3
keywords: def2-TZVPP
keywords: def2/J RIJCOSX GRIDX6 NOFINALGRIDX
keywords: grid4 nofinalgrid
keywords: scfconv7
keywords: smallprint printgap noloewdin
keywords: NOSOSCF
formula: C11H19NOS
InChI: InChI=1/C11H19NOS/c1-2-3-4-5-6-7-9-12-11(13)8-10-14-12/h8,10H,2-7,9H2,1H3
33 atoms
S  -1.169075 0.773995 0.944094
O  -3.205044 -0.195918 -2.065918
N  -1.895403 -0.246894 -0.193574
C  1.417037 -1.91769 0.429228
C  0.776368 -1.551403 -0.905687
C  2.807063 -1.32131 0.635186
C  -0.6042 -2.160226 -1.127833
C  2.821865 0.195883 0.787644
C  -1.685678 -1.685345 -0.164611
C  4.208596 0.753575 1.082707
C  4.214355 2.266678 1.241423
C  -2.624022 0.395024 -1.162962
C  -2.574105 1.826934 -0.908885
C  -1.838777 2.146041 0.167799
H  1.482505 -3.008415 0.496356
H  0.77844 -1.608344 1.263969
H  1.432312 -1.892963 -1.712213
H  0.71736 -0.465253 -1.01917
H  3.45534 -1.612258 -0.198982
H  3.251652 -1.768006 1.530401
H  -0.549114 -3.249398 -1.038283
H  -0.932453 -1.955032 -2.14938
H  2.138962 0.483119 1.594957
H  2.432159 0.671959 -0.11757
H  -1.460055 -1.975689 0.861883
H  -2.636287 -2.159803 -0.410162
H  4.600719 0.289736 1.993411
H  4.894661 0.468365 0.278854
H  3.868194 2.763576 0.332634
H  3.559581 2.583613 2.056113
H  5.214121 2.64522 1.460412
H  -3.084383 2.541225 -1.53747
H  -1.641482 3.130086 0.568285
elementType: S O N C H
totalener: -958.86384842 hartree
nucrepener: 1034.91203911 hartree
electener: -1993.77588753 hartree
oneelecener: -3364.05039847 hartree
twoeener: 1370.27451094 hartree
cpcmener: -0.02074980 hartree
kineticenergy: 955.51159791 hartree
xcener: -75.345976346014 hartree
chargesum: -0.0000000
charge: 0.105635 -0.551081 -0.049305 -0.126553 -0.154789 -0.128894 -0.113214 -0.093004 -0.127198 -0.090568 -0.274924 0.325764 -0.278615 -0.055642 0.082110 0.057810 0.083209 0.071682 0.060558 0.071910 0.077838 0.087090 0.046623 0.053931 0.123016 0.111467 0.054676 0.055815 0.076664 0.075255 0.091262 0.158535 0.172936
qa: 0.1056 -0.5511 -0.0493 -0.1266 -0.1548 -0.1289 -0.1132 -0.0930 -0.1272 -0.0906 -0.2749 0.3258 -0.2786 -0.0556 0.0821 0.0578 0.0832 0.0717 0.0606 0.0719 0.0778 0.0871 0.0466 0.0539 0.1230 0.1115 0.0547 0.0558 0.0767 0.0753 0.0913 0.1585 0.1729
va: 2.5605 1.9627 3.0404 3.8731 3.8806 3.8997 3.8283 3.8582 3.8809 3.8993 3.9421 4.1982 3.9288 3.9822 1.0149 1.0078 1.0141 1.0040 1.0101 1.0098 1.0167 1.0244 1.0099 1.0101 0.9925 1.0207 1.0076 1.0063 1.0017 1.0009 1.0045 0.9991 0.9849
dispcorr: -0.014101293 hartree
energy: -958.877949714322
dipole: 26.16972 -24.88501 1.28472 -4.01030 4.54745 0.53714 3.95876 -2.34899 1.60977
magnitude: 2.12847 au
magnitude: 5.41014 debye
