program: Orca
programVersion: 4.2.1
elementType: S O N C C C C C C C C C C C H H H H H H H H H H H H H H H H H H H
charge: 0
multiplicity: 1
keywords: wb97x-d3
keywords: def2-TZVPP
keywords: def2/J RIJCOSX GRIDX6 NOFINALGRIDX
keywords: grid4 nofinalgrid
keywords: scfconv7
keywords: smallprint printgap noloewdin
keywords: NOSOSCF
formula: C11H19NOS
InChI: InChI=1/C11H19NOS/c1-2-3-4-5-6-7-9-12-11(13)8-10-14-12/h8,10H,2-7,9H2,1H3
33 atoms
S  -2.883059 0.079609 1.062502
O  -1.960241 0.625706 -2.547589
N  -2.332729 -0.315135 -0.489907
C  1.900377 -1.279453 0.453114
C  0.611461 -0.947304 -0.287191
C  3.021117 -0.287632 0.168017
C  -0.512407 -1.929218 0.010238
C  4.316051 -0.622892 0.898065
C  -1.795886 -1.638746 -0.753814
C  5.475704 0.31746 0.581087
C  5.271473 1.742552 1.075278
C  -2.341668 0.724318 -1.38796
C  -2.872158 1.905369 -0.721529
C  -3.18505 1.69084 0.565216
H  2.228723 -2.288865 0.181403
H  1.703726 -1.305114 1.530867
H  0.801063 -0.93025 -1.365679
H  0.298718 0.066986 -0.017862
H  2.68288 0.717091 0.441305
H  3.213293 -0.259132 -0.910709
H  -0.71339 -1.953251 1.086725
H  -0.203188 -2.943844 -0.256901
H  4.610126 -1.646374 0.64301
H  4.136544 -0.622476 1.979409
H  -2.558534 -2.385999 -0.52437
H  -1.617754 -1.686041 -1.827882
H  6.389251 -0.084668 1.028137
H  5.64962 0.326311 -0.499942
H  5.086722 1.76443 2.151821
H  6.15274 2.357115 0.88365
H  4.427361 2.233051 0.58812
H  -2.986452 2.850101 -1.231031
H  -3.590867 2.396895 1.275137
elementType: S O N C H
totalener: -958.86583278 hartree
nucrepener: 992.14442000 hartree
electener: -1951.01025278 hartree
oneelecener: -3278.81080951 hartree
twoeener: 1327.80055673 hartree
cpcmener: -0.02073729 hartree
kineticenergy: 955.51608110 hartree
xcener: -75.344530532386 hartree
chargesum: 0.0000000
charge: 0.114436 -0.546158 -0.079436 -0.126684 -0.091139 -0.109908 -0.125626 -0.114430 -0.098641 -0.112304 -0.276161 0.308102 -0.262527 -0.065571 0.061760 0.060285 0.069862 0.056203 0.059616 0.058885 0.071576 0.080546 0.067319 0.060305 0.131155 0.104712 0.070258 0.053853 0.078837 0.091059 0.078554 0.158572 0.172688
qa: 0.1144 -0.5462 -0.0794 -0.1267 -0.0911 -0.1099 -0.1256 -0.1144 -0.0986 -0.1123 -0.2762 0.3081 -0.2625 -0.0656 0.0618 0.0603 0.0699 0.0562 0.0596 0.0589 0.0716 0.0805 0.0673 0.0603 0.1312 0.1047 0.0703 0.0539 0.0788 0.0911 0.0786 0.1586 0.1727
va: 2.5582 1.9671 3.0635 3.8972 3.8215 3.8655 3.8534 3.8820 3.8266 3.8985 3.9272 4.2097 3.9156 3.9956 1.0109 1.0087 1.0165 1.0169 1.0082 1.0091 1.0088 1.0202 1.0110 1.0083 1.0015 1.0276 1.0062 1.0082 1.0005 1.0045 0.9991 0.9990 0.9857
dispcorr: -0.012499671 hartree
energy: -958.878332454516
dipole: 33.68593 -34.03850 -0.35257 -3.24811 2.97496 -0.27315 4.86122 -2.83219 2.02903
magnitude: 2.07747 au
magnitude: 5.28051 debye
