program: Orca
programVersion: 4.2.1
elementType: S O N C C C C C C C C C C C H H H H H H H H H H H H H H H H H H H
charge: 0
multiplicity: 1
keywords: wb97x-d3
keywords: def2-TZVPP
keywords: def2/J RIJCOSX GRIDX6 NOFINALGRIDX
keywords: grid4 nofinalgrid
keywords: scfconv7
keywords: smallprint printgap noloewdin
keywords: NOSOSCF
formula: C11H19NOS
InChI: InChI=1/C11H19NOS/c1-2-3-4-5-6-7-9-12-11(13)8-10-14-12/h8,10H,2-7,9H2,1H3
33 atoms
S  -2.555687 0.392235 1.130611
O  -2.986384 -0.05745 -2.579954
N  -2.439636 -0.3635 -0.380912
C  2.06386 -0.79501 -0.260807
C  0.590031 -0.838058 0.12366
C  2.934499 -0.146477 0.80864
C  -0.284398 -1.489753 -0.939162
C  4.411414 -0.096181 0.439758
C  -1.747688 -1.63248 -0.546148
C  5.279503 0.55005 1.512491
C  6.75273 0.594277 1.13713
C  -2.991248 0.340561 -1.420667
C  -3.554532 1.576334 -0.898044
C  -3.384899 1.714006 0.426457
H  2.177515 -0.249345 -1.203863
H  2.421019 -1.812584 -0.453568
H  0.247402 0.183109 0.317356
H  0.47985 -1.383291 1.067999
H  2.814986 -0.691973 1.751399
H  2.573687 0.870211 1.00036
H  0.087007 -2.49726 -1.150077
H  -0.215799 -0.93515 -1.879151
H  4.532666 0.451235 -0.501664
H  4.772889 -1.112485 0.246799
H  -1.843153 -2.197489 0.383204
H  -2.289301 -2.195244 -1.306739
H  4.921931 1.566545 1.705279
H  5.159711 0.004252 2.453782
H  7.352646 1.061074 1.92012
H  7.152257 -0.408833 0.973553
H  6.912897 1.163765 0.219207
H  -4.052363 2.295728 -1.530254
H  -3.704845 2.53395 1.052825
elementType: S O N C H
totalener: -958.86651382 hartree
nucrepener: 978.16418614 hartree
electener: -1937.03069996 hartree
oneelecener: -3250.69852885 hartree
twoeener: 1313.66782889 hartree
cpcmener: -0.02090998 hartree
kineticenergy: 955.51228774 hartree
xcener: -75.342704484763 hartree
chargesum: 0.0000000
charge: 0.117505 -0.552693 -0.073269 -0.125753 -0.129271 -0.101240 -0.081415 -0.113423 -0.110118 -0.079733 -0.283541 0.326696 -0.277391 -0.061453 0.062026 0.061223 0.058881 0.069092 0.056306 0.057333 0.075918 0.072478 0.056359 0.056009 0.122036 0.110975 0.054562 0.053879 0.090439 0.078339 0.077910 0.158574 0.172759
qa: 0.1175 -0.5527 -0.0733 -0.1258 -0.1293 -0.1012 -0.0814 -0.1134 -0.1101 -0.0797 -0.2835 0.3267 -0.2774 -0.0615 0.0620 0.0612 0.0589 0.0691 0.0563 0.0573 0.0759 0.0725 0.0564 0.0560 0.1220 0.1110 0.0546 0.0539 0.0904 0.0783 0.0779 0.1586 0.1728
va: 2.5576 1.9583 3.0730 3.9307 3.8775 3.8727 3.7930 3.8860 3.8720 3.8747 3.9474 4.2001 3.9255 3.9781 1.0101 1.0113 1.0142 1.0055 1.0104 1.0104 1.0165 1.0229 1.0085 1.0085 1.0006 1.0222 1.0068 1.0068 1.0040 1.0004 1.0007 0.9995 0.9852
dispcorr: -0.012035973 hartree
energy: -958.878549792484
dipole: 37.33648 -37.00134 0.33514 -3.20312 3.52691 0.32380 4.73495 -2.66161 2.07334
magnitude: 2.12506 au
magnitude: 5.40148 debye
