program: Orca
programVersion: 4.2.1
elementType: S O N C C C C C C C C C C C H H H H H H H H H H H H H H H H H H H
charge: 0
multiplicity: 1
keywords: wb97x-d3
keywords: def2-TZVPP
keywords: def2/J RIJCOSX GRIDX6 NOFINALGRIDX
keywords: grid4 nofinalgrid
keywords: scfconv7
keywords: smallprint printgap noloewdin
keywords: NOSOSCF
formula: C11H19NOS
InChI: InChI=1/C11H19NOS/c1-2-3-4-5-6-7-9-12-11(13)8-10-14-12/h8,10H,2-7,9H2,1H3
33 atoms
S  -2.837093 0.117299 0.869407
O  -0.511974 0.709491 -2.03613
N  -1.858941 -0.274686 -0.459672
C  1.528856 -1.781652 -0.435476
C  0.490217 -1.785675 0.680671
C  2.864183 -1.156905 -0.038356
C  -0.842637 -2.415567 0.292657
C  2.790062 0.33618 0.265657
C  -1.61727 -1.668995 -0.787731
C  4.158445 0.965151 0.497238
C  4.084898 2.451735 0.810285
C  -1.255357 0.798935 -1.066795
C  -1.660257 2.012511 -0.370584
C  -2.488108 1.781094 0.659043
H  1.143569 -1.248617 -1.308935
H  1.700712 -2.813949 -0.758929
H  0.316675 -0.768294 1.043722
H  0.891568 -2.338603 1.535822
H  3.576323 -1.313899 -0.855213
H  3.277767 -1.687224 0.826911
H  -1.46956 -2.513915 1.184164
H  -0.685277 -3.435024 -0.071657
H  2.165442 0.511117 1.147534
H  2.288024 0.84774 -0.563766
H  -2.574668 -2.1626 -0.968063
H  -1.082158 -1.672465 -1.735909
H  4.663836 0.445529 1.317783
H  4.783051 0.809916 -0.388252
H  3.502668 2.640193 1.714708
H  5.077198 2.878543 0.96589
H  3.613967 3.007182 -0.003453
H  -1.314737 2.989479 -0.672374
H  -2.931712 2.505156 1.326577
elementType: S O N C H
totalener: -958.86425640 hartree
nucrepener: 1040.30404379 hartree
electener: -1999.16830019 hartree
oneelecener: -3375.46234456 hartree
twoeener: 1376.29404437 hartree
cpcmener: -0.01896190 hartree
kineticenergy: 955.50883787 hartree
xcener: -75.344777449574 hartree
chargesum: 0.0000000
charge: 0.113321 -0.538616 -0.063833 -0.129061 -0.100313 -0.134773 -0.160557 -0.096860 -0.105494 -0.086931 -0.276938 0.300418 -0.262831 -0.062794 0.063179 0.076212 0.054044 0.083670 0.069448 0.060225 0.088539 0.080116 0.053274 0.050141 0.133498 0.108347 0.053568 0.055471 0.075430 0.090847 0.077880 0.158276 0.173099
qa: 0.1133 -0.5386 -0.0638 -0.1291 -0.1003 -0.1348 -0.1606 -0.0969 -0.1055 -0.0869 -0.2769 0.3004 -0.2628 -0.0628 0.0632 0.0762 0.0540 0.0837 0.0694 0.0602 0.0885 0.0801 0.0533 0.0501 0.1335 0.1083 0.0536 0.0555 0.0754 0.0908 0.0779 0.1583 0.1731
va: 2.5555 1.9718 3.0738 3.8643 3.8366 3.9106 3.9081 3.8533 3.8076 3.8903 3.9430 4.1995 3.9230 3.9903 1.0316 1.0132 1.0152 1.0122 1.0099 1.0098 1.0058 1.0197 1.0068 1.0208 1.0017 1.0181 1.0061 1.0076 1.0018 1.0040 1.0011 0.9996 0.9852
dispcorr: -0.014347734 hartree
energy: -958.878604131889
dipole: 25.45016 -26.61317 -1.16301 -3.30555 2.97024 -0.33531 3.55548 -1.88390 1.67158
magnitude: 2.06378 au
magnitude: 5.24572 debye
