program: Orca
programVersion: 4.2.1
elementType: S O N C C C C C C C C C C C H H H H H H H H H H H H H H H H H H H
charge: 0
multiplicity: 1
keywords: wb97x-d3
keywords: def2-TZVPP
keywords: def2/J RIJCOSX GRIDX6 NOFINALGRIDX
keywords: grid4 nofinalgrid
keywords: scfconv7
keywords: smallprint printgap noloewdin
keywords: NOSOSCF
formula: C11H19NOS
InChI: InChI=1/C11H19NOS/c1-2-3-4-5-6-7-9-12-11(13)8-10-14-12/h8,10H,2-7,9H2,1H3
33 atoms
S  -3.007087 -0.162487 1.009891
O  -1.900816 0.947478 -2.415784
N  -2.339555 -0.299546 -0.542811
C  1.894111 -1.164175 0.504814
C  0.630744 -0.795907 -0.264187
C  2.97409 -0.091772 0.425211
C  -0.44668 -1.867032 -0.17038
C  4.231785 -0.45281 1.207522
C  -1.711319 -1.542636 -0.953467
C  5.301095 0.636911 1.215982
C  5.88951 0.943587 -0.154136
C  -2.357926 0.856291 -1.283366
C  -3.001058 1.899485 -0.495635
C  -3.378635 1.485624 0.723075
H  2.292055 -2.110466 0.122331
H  1.638491 -1.344781 1.554735
H  0.87829 -0.62115 -1.316301
H  0.245166 0.153963 0.120448
H  2.572105 0.854227 0.805422
H  3.222413 0.084336 -0.625966
H  -0.696146 -2.055135 0.879085
H  -0.063963 -2.814427 -0.560426
H  4.660305 -1.376582 0.802912
H  3.952327 -0.678214 2.241956
H  -2.43599 -2.354333 -0.860891
H  -1.487358 -1.435384 -2.014445
H  4.88081 1.552095 1.645223
H  6.108262 0.332149 1.888051
H  5.144443 1.344275 -0.842815
H  6.689519 1.682194 -0.081573
H  6.313367 0.047647 -0.612987
H  -3.14301 2.90012 -0.874175
H  -3.869338 2.060862 1.494569
elementType: S O N C H
totalener: -958.86588306 hartree
nucrepener: 990.21724537 hartree
electener: -1949.08312844 hartree
oneelecener: -3274.97420312 hartree
twoeener: 1325.89107469 hartree
cpcmener: -0.02071825 hartree
kineticenergy: 955.51192307 hartree
xcener: -75.343732896095 hartree
chargesum: -0.0000000
charge: 0.113297 -0.545586 -0.078594 -0.127404 -0.090055 -0.111700 -0.125573 -0.115897 -0.098127 -0.114109 -0.277546 0.306975 -0.262452 -0.065406 0.062548 0.060024 0.068995 0.056588 0.059362 0.061845 0.070623 0.081554 0.062251 0.066274 0.130598 0.104273 0.054210 0.070151 0.079847 0.091851 0.079073 0.158973 0.173138
qa: 0.1133 -0.5456 -0.0786 -0.1274 -0.0901 -0.1117 -0.1256 -0.1159 -0.0981 -0.1141 -0.2775 0.3070 -0.2625 -0.0654 0.0625 0.0600 0.0690 0.0566 0.0594 0.0618 0.0706 0.0816 0.0623 0.0663 0.1306 0.1043 0.0542 0.0702 0.0798 0.0919 0.0791 0.1590 0.1731
va: 2.5555 1.9677 3.0623 3.9006 3.8221 3.8660 3.8532 3.8771 3.8287 3.8986 3.9272 4.2113 3.9154 3.9954 1.0095 1.0102 1.0171 1.0172 1.0085 1.0082 1.0092 1.0197 1.0081 1.0117 1.0015 1.0278 1.0086 1.0067 0.9988 1.0040 1.0006 0.9988 0.9854
dispcorr: -0.012493762 hartree
energy: -958.878376826473
dipole: 34.83115 -35.31332 -0.48217 -3.59763 3.03732 -0.56030 3.54856 -1.56850 1.98005
magnitude: 2.11354 au
magnitude: 5.37218 debye
