program: Orca
programVersion: 4.2.1
elementType: S O N C C C C C C C C C C C H H H H H H H H H H H H H H H H H H H
charge: 0
multiplicity: 1
keywords: wb97x-d3
keywords: def2-TZVPP
keywords: def2/J RIJCOSX GRIDX6 NOFINALGRIDX
keywords: grid4 nofinalgrid
keywords: scfconv7
keywords: smallprint printgap noloewdin
keywords: NOSOSCF
formula: C11H19NOS
InChI: InChI=1/C11H19NOS/c1-2-3-4-5-6-7-9-12-11(13)8-10-14-12/h8,10H,2-7,9H2,1H3
33 atoms
S  -2.973511 -0.070503 1.05352
O  -2.161729 0.649172 -2.554231
N  -2.358509 -0.352362 -0.50128
C  1.991124 -0.529448 0.415347
C  0.656065 -0.426449 -0.314083
C  2.90667 0.657397 0.135736
C  -0.263959 -1.603415 -0.021665
C  4.220388 0.64255 0.913109
C  -1.58941 -1.554332 -0.769305
C  5.162546 -0.498495 0.545845
C  6.491796 -0.419178 1.282413
C  -2.557884 0.67013 -1.395556
C  -3.299455 1.730642 -0.726653
C  -3.570287 1.457728 0.558347
H  2.483821 -1.46361 0.12887
H  1.809785 -0.598199 1.493993
H  0.830553 -0.361288 -1.393174
H  0.166009 0.509374 -0.026625
H  2.368166 1.579573 0.376762
H  3.121564 0.705991 -0.937418
H  -0.445555 -1.676271 1.055709
H  0.226441 -2.53868 -0.306152
H  4.00702 0.606352 1.987329
H  4.738172 1.592138 0.74219
H  -2.197645 -2.427779 -0.524575
H  -1.421613 -1.574824 -1.845739
H  4.691952 -1.461559 0.761542
H  5.342872 -0.483033 -0.533915
H  7.154514 -1.239703 1.002817
H  7.014708 0.513696 1.061628
H  6.35116 -0.466986 2.364265
H  -3.585948 2.639264 -1.233621
H  -4.101186 2.075691 1.267573
elementType: S O N C H
totalener: -958.86574127 hartree
nucrepener: 988.84659295 hartree
electener: -1947.71233422 hartree
oneelecener: -3272.19649581 hartree
twoeener: 1324.48416159 hartree
cpcmener: -0.02076521 hartree
kineticenergy: 955.51066326 hartree
xcener: -75.343313389303 hartree
chargesum: 0.0000000
charge: 0.113783 -0.546209 -0.080055 -0.121300 -0.104260 -0.114654 -0.121292 -0.138544 -0.098996 -0.078904 -0.285316 0.309256 -0.263357 -0.064661 0.064281 0.060290 0.069954 0.057023 0.071379 0.062077 0.071402 0.081638 0.059257 0.070446 0.130689 0.105215 0.055997 0.056918 0.090234 0.077999 0.078487 0.158688 0.172534
qa: 0.1138 -0.5462 -0.0801 -0.1213 -0.1043 -0.1147 -0.1213 -0.1385 -0.0990 -0.0789 -0.2853 0.3093 -0.2634 -0.0647 0.0643 0.0603 0.0700 0.0570 0.0714 0.0621 0.0714 0.0816 0.0593 0.0704 0.1307 0.1052 0.0560 0.0569 0.0902 0.0780 0.0785 0.1587 0.1725
va: 2.5557 1.9668 3.0634 3.8797 3.8403 3.8892 3.8481 3.8959 3.8262 3.8531 3.9493 4.2091 3.9170 3.9953 1.0087 1.0082 1.0163 1.0179 1.0104 1.0097 1.0090 1.0200 1.0077 1.0095 1.0015 1.0270 1.0081 1.0061 1.0035 1.0016 0.9999 0.9989 0.9856
dispcorr: -0.012518854 hartree
energy: -958.878260123889
dipole: 36.39654 -36.74121 -0.34467 -3.85988 3.53183 -0.32806 5.12893 -3.11046 2.01847
magnitude: 2.07380 au
magnitude: 5.27118 debye
