program: Orca
programVersion: 4.2.1
elementType: S O N C C C C C C C C C C C H H H H H H H H H H H H H H H H H H H
charge: 0
multiplicity: 1
keywords: wb97x-d3
keywords: def2-TZVPP
keywords: def2/J RIJCOSX GRIDX6 NOFINALGRIDX
keywords: grid4 nofinalgrid
keywords: scfconv7
keywords: smallprint printgap noloewdin
keywords: NOSOSCF
formula: C11H19NOS
InChI: InChI=1/C11H19NOS/c1-2-3-4-5-6-7-9-12-11(13)8-10-14-12/h8,10H,2-7,9H2,1H3
33 atoms
S  -2.677359 0.178027 -1.225367
O  -0.765727 0.597711 1.994841
N  -1.890136 -0.290588 0.202342
C  1.461398 -1.822471 0.52976
C  0.570835 -1.768509 -0.706736
C  2.826158 -1.164856 0.340069
C  -0.800865 -2.406403 -0.517431
C  2.769514 0.344468 0.12582
C  -1.701423 -1.701215 0.491551
C  4.14909 0.990341 0.081724
C  4.094485 2.493698 -0.144194
C  -1.368373 0.744656 0.938799
C  -1.668429 1.995753 0.256076
C  -2.349417 1.825371 -0.886678
H  1.607402 -2.870928 0.810262
H  0.96188 -1.346966 1.378032
H  1.07629 -2.283853 -1.529365
H  0.444492 -0.734771 -1.041515
H  3.348858 -1.634551 -0.500733
H  3.436147 -1.370627 1.225661
H  -0.691609 -3.441574 -0.181123
H  -1.311746 -2.460573 -1.483499
H  2.177079 0.800217 0.927356
H  2.242655 0.574722 -0.805606
H  -1.287128 -1.753729 1.496909
H  -2.676624 -2.191318 0.527998
H  4.67836 0.782201 1.016984
H  4.742545 0.524568 -0.71155
H  5.093428 2.932418 -0.16612
H  3.610003 2.73714 -1.092024
H  3.534344 2.99481 0.647854
H  -1.362788 2.952447 0.651158
H  -2.69443 2.587164 -1.570248
elementType: S O N C H
totalener: -958.86436027 hartree
nucrepener: 1041.92295617 hartree
electener: -2000.78731644 hartree
oneelecener: -3378.70154057 hartree
twoeener: 1377.91422413 hartree
cpcmener: -0.01904534 hartree
kineticenergy: 955.51020812 hartree
xcener: -75.345370181290 hartree
chargesum: 0.0000000
charge: 0.112967 -0.539716 -0.063867 -0.128759 -0.103833 -0.136345 -0.157623 -0.095634 -0.105966 -0.087340 -0.276489 0.300815 -0.263846 -0.060534 0.077182 0.063204 0.084355 0.054554 0.060060 0.069670 0.079706 0.088669 0.050677 0.052213 0.108924 0.133266 0.054470 0.054519 0.089829 0.076131 0.077926 0.158631 0.172186
qa: 0.1130 -0.5397 -0.0639 -0.1288 -0.1038 -0.1363 -0.1576 -0.0956 -0.1060 -0.0873 -0.2765 0.3008 -0.2638 -0.0605 0.0772 0.0632 0.0844 0.0546 0.0601 0.0697 0.0797 0.0887 0.0507 0.0522 0.1089 0.1333 0.0545 0.0545 0.0898 0.0761 0.0779 0.1586 0.1722
va: 2.5549 1.9702 3.0751 3.8616 3.8384 3.9120 3.9057 3.8537 3.8066 3.8916 3.9430 4.1977 3.9237 3.9889 1.0129 1.0320 1.0123 1.0148 1.0097 1.0099 1.0198 1.0059 1.0212 1.0073 1.0182 1.0017 1.0078 1.0061 1.0041 1.0018 1.0009 0.9995 0.9854
dispcorr: -0.014421534 hartree
energy: -958.878781804991
dipole: 25.44819 -26.37409 -0.92590 -3.19817 2.96118 -0.23699 -0.40669 -1.42515 -1.83183
magnitude: 2.06617 au
magnitude: 5.25179 debye
