program: Orca
programVersion: 4.2.1
elementType: S O N C C C C C C C C C C C H H H H H H H H H H H H H H H H H H H
charge: 0
multiplicity: 1
keywords: wb97x-d3
keywords: def2-TZVPP
keywords: def2/J RIJCOSX GRIDX6 NOFINALGRIDX
keywords: grid4 nofinalgrid
keywords: scfconv7
keywords: smallprint printgap noloewdin
keywords: NOSOSCF
formula: C11H19NOS
InChI: InChI=1/C11H19NOS/c1-2-3-4-5-6-7-9-12-11(13)8-10-14-12/h8,10H,2-7,9H2,1H3
33 atoms
S  -1.795758 0.737867 -1.612969
O  -2.305274 -0.095068 2.018693
N  -1.920251 -0.229762 -0.230303
C  2.266601 -1.794088 -0.308172
C  0.844536 -1.510605 -0.784856
C  2.64542 -1.125753 1.013917
C  -0.235501 -2.013092 0.164044
C  2.428486 0.385857 1.059642
C  -1.651071 -1.659778 -0.270058
C  3.164243 1.183542 -0.013944
C  4.678741 1.051744 0.050585
C  -2.188533 0.453502 0.928844
C  -2.307011 1.869545 0.617046
C  -2.116541 2.139876 -0.684226
H  2.96374 -1.47991 -1.090865
H  2.40662 -2.875171 -0.207507
H  0.699159 -1.973758 -1.766139
H  0.731265 -0.435211 -0.948503
H  3.692927 -1.354754 1.230854
H  2.07923 -1.579627 1.832524
H  -0.077051 -1.631731 1.175535
H  -0.177449 -3.103297 0.239404
H  2.738474 0.750312 2.044494
H  1.357681 0.605904 0.993681
H  -2.380851 -2.146057 0.377812
H  -1.849289 -2.017919 -1.282065
H  2.815577 0.889924 -1.008823
H  2.89299 2.237789 0.091833
H  5.013984 0.033531 -0.154596
H  5.163276 1.701728 -0.680041
H  5.059356 1.328683 1.036531
H  -2.522984 2.609434 1.372808
H  -2.150139 3.102898 -1.173284
elementType: S O N C H
totalener: -958.86165619 hartree
nucrepener: 1048.31020269 hartree
electener: -2007.17185888 hartree
oneelecener: -3391.14198708 hartree
twoeener: 1383.97012820 hartree
cpcmener: -0.02058721 hartree
kineticenergy: 955.51001674 hartree
xcener: -75.348376891334 hartree
chargesum: -0.0000000
charge: 0.115607 -0.549054 -0.063103 -0.151808 -0.133481 -0.177966 -0.105377 -0.114769 -0.101777 -0.113735 -0.275595 0.308163 -0.268835 -0.057882 0.078611 0.078506 0.090118 0.046278 0.082837 0.083270 0.073834 0.082794 0.079043 0.055836 0.112546 0.116386 0.055134 0.071922 0.076158 0.093452 0.081907 0.157828 0.173149
qa: 0.1156 -0.5491 -0.0631 -0.1518 -0.1335 -0.1780 -0.1054 -0.1148 -0.1018 -0.1137 -0.2756 0.3082 -0.2688 -0.0579 0.0786 0.0785 0.0901 0.0463 0.0828 0.0833 0.0738 0.0828 0.0790 0.0558 0.1125 0.1164 0.0551 0.0719 0.0762 0.0935 0.0819 0.1578 0.1731
va: 2.5538 1.9607 3.0521 3.9141 3.8583 3.8807 3.7757 3.8686 3.8904 3.8814 3.9361 4.1982 3.9292 3.9712 1.0017 1.0100 1.0106 1.0141 1.0020 1.0043 1.0289 1.0181 1.0092 1.0109 1.0178 1.0007 1.0040 1.0071 0.9996 1.0045 1.0013 1.0005 0.9848
dispcorr: -0.014996158 hartree
energy: -958.876652349098
dipole: 26.89092 -26.46554 0.42538 -5.13942 5.64575 0.50633 1.96722 -3.95503 -1.98781
magnitude: 2.09492 au
magnitude: 5.32487 debye
