program: Orca
programVersion: 4.2.1
elementType: S O N C C C C C C C C C C C H H H H H H H H H H H H H H H H H H H
charge: 0
multiplicity: 1
keywords: wb97x-d3
keywords: def2-TZVPP
keywords: def2/J RIJCOSX GRIDX6 NOFINALGRIDX
keywords: grid4 nofinalgrid
keywords: scfconv7
keywords: smallprint printgap noloewdin
keywords: NOSOSCF
formula: C11H19NOS
InChI: InChI=1/C11H19NOS/c1-2-3-4-5-6-7-9-12-11(13)8-10-14-12/h8,10H,2-7,9H2,1H3
33 atoms
S  -3.347321 0.0280 1.031145
O  -2.822955 0.538053 -2.662314
N  -2.598198 -0.124344 -0.480075
C  2.329175 -0.023629 0.456277
C  1.157264 -0.766194 -0.172694
C  3.66371 -0.731869 0.262812
C  -0.168944 -0.043065 0.019646
C  4.83411 0.011475 0.893686
C  -1.325926 -0.812559 -0.60006
C  6.172336 -0.690447 0.700972
C  7.332842 0.060186 1.335569
C  -3.235476 0.524828 -1.509021
C  -4.438772 1.153268 -0.983639
C  -4.599278 0.967422 0.335355
H  2.140839 0.109395 1.527325
H  2.388283 0.984655 0.03197
H  1.091687 -1.771864 0.256689
H  1.344552 -0.903688 -1.243019
H  3.852266 -0.86391 -0.808443
H  3.604409 -1.741039 0.685695
H  -0.119771 0.953257 -0.429189
H  -0.350087 0.103659 1.089449
H  4.646096 0.142479 1.965362
H  4.89177 1.021575 0.472517
H  -1.415415 -1.805725 -0.153303
H  -1.15694 -0.961379 -1.666591
H  6.11711 -1.699456 1.122021
H  6.363312 -0.82003 -0.369069
H  7.19195 0.175025 2.412502
H  8.279519 -0.461164 1.184201
H  7.439557 1.060999 0.911622
H  -5.11524 1.713777 -1.610768
H  -5.400525 1.330203 0.962632
elementType: S O N C H
totalener: -958.86756936 hartree
nucrepener: 949.75418984 hartree
electener: -1908.62175920 hartree
oneelecener: -3193.81884241 hartree
twoeener: 1285.19708320 hartree
cpcmener: -0.02071890 hartree
kineticenergy: 955.51430642 hartree
xcener: -75.342355985419 hartree
chargesum: 0.0000000
charge: 0.114744 -0.550130 -0.073972 -0.110425 -0.137678 -0.109460 -0.082249 -0.109604 -0.083906 -0.081310 -0.282187 0.316882 -0.270016 -0.070096 0.060616 0.060819 0.064110 0.069437 0.058126 0.056893 0.076520 0.064506 0.055741 0.055773 0.124214 0.096337 0.054194 0.055099 0.077658 0.090145 0.077977 0.158813 0.172429
qa: 0.1147 -0.5501 -0.0740 -0.1104 -0.1377 -0.1095 -0.0822 -0.1096 -0.0839 -0.0813 -0.2822 0.3169 -0.2700 -0.0701 0.0606 0.0608 0.0641 0.0694 0.0581 0.0569 0.0765 0.0645 0.0557 0.0558 0.1242 0.0963 0.0542 0.0551 0.0777 0.0901 0.0780 0.1588 0.1724
va: 2.5551 1.9658 3.0889 3.8885 3.9167 3.8871 3.8520 3.8807 3.7977 3.8766 3.9476 4.2122 3.9135 3.9935 1.0094 1.0100 1.0111 1.0100 1.0101 1.0102 1.0159 1.0190 1.0083 1.0084 1.0008 1.0327 1.0065 1.0065 1.0005 1.0044 1.0005 0.9986 0.9861
dispcorr: -0.011166628 hartree
energy: -958.878735992530
dipole: 43.16440 -43.38221 -0.21781 -3.22226 3.01491 -0.20735 5.96060 -3.88664 2.07396
magnitude: 2.09565 au
magnitude: 5.32671 debye
