program: Orca
programVersion: 4.2.1
elementType: S O N C C C C C C C C C C C H H H H H H H H H H H H H H H H H H H
charge: 0
multiplicity: 1
keywords: wb97x-d3
keywords: def2-TZVPP
keywords: def2/J RIJCOSX GRIDX6 NOFINALGRIDX
keywords: grid4 nofinalgrid
keywords: scfconv7
keywords: smallprint printgap noloewdin
keywords: NOSOSCF
formula: C11H19NOS
InChI: InChI=1/C11H19NOS/c1-2-3-4-5-6-7-9-12-11(13)8-10-14-12/h8,10H,2-7,9H2,1H3
33 atoms
S  -2.463154 1.759876 0.159233
O  -3.342451 -1.684936 -1.079346
N  -2.25886 0.287145 -0.652426
C  2.559772 -1.084912 -0.075395
C  1.40983 -0.714962 -1.00948
C  3.057256 0.066931 0.791015
C  0.113748 -0.352592 -0.293807
C  4.171737 -0.319705 1.761917
C  -0.99394 -0.030624 -1.287521
C  5.455738 -0.845993 1.123901
C  6.1240 0.138368 0.174656
C  -3.329786 -0.569732 -0.573563
C  -4.387228 0.081178 0.186597
C  -4.04827 1.302331 0.625458
H  3.383346 -1.46387 -0.686292
H  2.252671 -1.918406 0.565654
H  1.216318 -1.558374 -1.679481
H  1.718219 0.116865 -1.651977
H  2.22901 0.470698 1.379438
H  3.387201 0.887833 0.145912
H  0.26981 0.50699 0.364048
H  -0.204559 -1.182775 0.343373
H  3.788182 -1.074343 2.456392
H  4.417721 0.553046 2.375716
H  -1.181921 -0.882539 -1.940632
H  -0.702885 0.801858 -1.932228
H  6.156824 -1.099635 1.9239
H  5.25976 -1.784353 0.597878
H  7.074158 -0.252964 -0.192722
H  5.507078 0.3529 -0.699557
H  6.332691 1.089648 0.669523
H  -5.338644 -0.394952 0.36993
H  -4.647142 1.98623 1.209308
elementType: S O N C H
totalener: -958.86362703 hartree
nucrepener: 977.01339435 hartree
electener: -1935.87702138 hartree
oneelecener: -3248.30478688 hartree
twoeener: 1312.42776550 hartree
cpcmener: -0.02058432 hartree
kineticenergy: 955.50991625 hartree
xcener: -75.344922649964 hartree
chargesum: -0.0000000
charge: 0.113822 -0.549926 -0.073377 -0.131400 -0.153594 -0.138043 -0.082436 -0.152026 -0.092714 -0.120009 -0.272437 0.318878 -0.271100 -0.068798 0.077676 0.068101 0.083278 0.068361 0.079060 0.069378 0.064879 0.077459 0.070376 0.074845 0.097859 0.124968 0.072861 0.061055 0.093067 0.076637 0.081810 0.159912 0.171582
qa: 0.1138 -0.5499 -0.0734 -0.1314 -0.1536 -0.1380 -0.0824 -0.1520 -0.0927 -0.1200 -0.2724 0.3189 -0.2711 -0.0688 0.0777 0.0681 0.0833 0.0684 0.0791 0.0694 0.0649 0.0775 0.0704 0.0748 0.0979 0.1250 0.0729 0.0611 0.0931 0.0766 0.0818 0.1599 0.1716
va: 2.5530 1.9652 3.0878 3.8799 3.9278 3.8557 3.8347 3.9018 3.8055 3.8791 3.9259 4.2092 3.9158 3.9936 1.0096 1.0092 1.0091 1.0100 1.0140 1.0012 1.0193 1.0158 1.0099 1.0063 1.0326 1.0004 1.0075 1.0023 1.0048 0.9987 1.0011 0.9981 0.9864
dispcorr: -0.012299728 hartree
energy: -958.875926755159
dipole: 38.49225 -37.94110 0.55115 -4.67254 6.51494 1.84240 3.41658 -2.61312 0.80346
magnitude: 2.08416 au
magnitude: 5.29752 debye
