program: Orca
programVersion: 4.2.1
elementType: S O N C C C C C C C C C C C H H H H H H H H H H H H H H H H H H H
charge: 0
multiplicity: 1
keywords: wb97x-d3
keywords: def2-TZVPP
keywords: def2/J RIJCOSX GRIDX6 NOFINALGRIDX
keywords: grid4 nofinalgrid
keywords: scfconv7
keywords: smallprint printgap noloewdin
keywords: NOSOSCF
formula: C11H19NOS
InChI: InChI=1/C11H19NOS/c1-2-3-4-5-6-7-9-12-11(13)8-10-14-12/h8,10H,2-7,9H2,1H3
33 atoms
S  -2.663467 0.15141 1.084945
O  -1.487986 0.702494 -2.451724
N  -2.13082 -0.258731 -0.472069
C  1.840362 -1.995323 0.4861
C  0.656746 -1.41059 -0.27708
C  3.166426 -1.286055 0.223057
C  -0.628468 -2.191162 -0.039884
C  3.206082 0.168809 0.677133
C  -1.832832 -1.643004 -0.793414
C  4.570186 0.818187 0.476822
C  4.606523 2.270863 0.926989
C  -1.899837 0.809291 -1.303416
C  -2.227311 2.033389 -0.584633
C  -2.634283 1.814959 0.674589
H  1.94802 -3.051862 0.220283
H  1.624898 -1.974547 1.560209
H  0.882757 -1.396917 -1.348632
H  0.509597 -0.367809 0.017682
H  3.399376 -1.339925 -0.846101
H  3.964114 -1.836191 0.732811
H  -0.847394 -2.231389 1.032348
H  -0.498393 -3.229556 -0.357615
H  2.930491 0.224707 1.736539
H  2.454675 0.753451 0.137222
H  -2.716983 -2.252128 -0.594028
H  -1.65979 -1.677004 -1.868772
H  5.328445 0.247784 1.022408
H  4.847882 0.757675 -0.580171
H  3.884136 2.876015 0.375467
H  4.369447 2.364387 1.988753
H  5.591184 2.71441 0.771484
H  -2.136903 3.008283 -1.038739
H  -2.930087 2.548533 1.410144
elementType: S O N C H
totalener: -958.86576929 hartree
nucrepener: 1010.44695306 hartree
electener: -1969.31272235 hartree
oneelecener: -3315.47647542 hartree
twoeener: 1346.16375307 hartree
cpcmener: -0.02050917 hartree
kineticenergy: 955.51223163 hartree
xcener: -75.343811319949 hartree
chargesum: 0.0000000
charge: 0.114725 -0.543944 -0.079417 -0.133902 -0.089815 -0.130778 -0.139686 -0.107482 -0.089732 -0.087520 -0.277020 0.304220 -0.262627 -0.063471 0.074075 0.064476 0.072056 0.053367 0.063105 0.071075 0.072953 0.082033 0.057027 0.056775 0.129763 0.103678 0.055603 0.054974 0.077757 0.077064 0.089867 0.158789 0.172010
qa: 0.1147 -0.5439 -0.0794 -0.1339 -0.0898 -0.1308 -0.1397 -0.1075 -0.0897 -0.0875 -0.2770 0.3042 -0.2626 -0.0635 0.0741 0.0645 0.0721 0.0534 0.0631 0.0711 0.0730 0.0820 0.0570 0.0568 0.1298 0.1037 0.0556 0.0550 0.0778 0.0771 0.0899 0.1588 0.1720
va: 2.5537 1.9692 3.0656 3.9078 3.8042 3.8996 3.8692 3.8586 3.8248 3.8870 3.9446 4.2118 3.9167 3.9940 1.0112 1.0080 1.0159 1.0161 1.0090 1.0109 1.0085 1.0205 1.0075 1.0073 1.0022 1.0277 1.0074 1.0062 1.0011 1.0008 1.0046 0.9990 0.9858
dispcorr: -0.012830669 hartree
energy: -958.878599962267
dipole: 29.23187 -29.72577 -0.49390 -3.72246 3.41630 -0.30616 4.11826 -2.13075 1.98751
magnitude: 2.07071 au
magnitude: 5.26334 debye
