program: Orca
programVersion: 4.2.1
elementType: S O N C C C C C C C C C C C H H H H H H H H H H H H H H H H H H H
charge: 0
multiplicity: 1
keywords: wb97x-d3
keywords: def2-TZVPP
keywords: def2/J RIJCOSX GRIDX6 NOFINALGRIDX
keywords: grid4 nofinalgrid
keywords: scfconv7
keywords: smallprint printgap noloewdin
keywords: NOSOSCF
formula: C11H19NOS
InChI: InChI=1/C11H19NOS/c1-2-3-4-5-6-7-9-12-11(13)8-10-14-12/h8,10H,2-7,9H2,1H3
33 atoms
S  -3.162295 -0.115109 0.860887
O  -1.623635 1.42651 -2.210858
N  -2.14384 0.010168 -0.48816
C  2.228994 -2.073603 0.899865
C  1.091356 -1.984354 -0.114776
C  3.048484 -0.79959 1.097066
C  0.051128 -0.919973 0.212247
C  3.714512 -0.285256 -0.174007
C  -1.135679 -1.002757 -0.737825
C  4.612437 0.93134 0.041761
C  5.855434 0.651592 0.875723
C  -2.296166 1.159778 -1.22271
C  -3.362007 1.951941 -0.624983
C  -3.887476 1.388593 0.47312
H  2.901994 -2.880993 0.594496
H  1.81431 -2.377558 1.866175
H  0.599082 -2.960965 -0.160622
H  1.490183 -1.806559 -1.117855
H  3.809774 -1.010425 1.853392
H  2.422105 -0.008546 1.522377
H  0.487686 0.080247 0.148186
H  -0.291712 -1.048906 1.24438
H  2.945811 -0.021672 -0.906483
H  4.301468 -1.091177 -0.62941
H  -1.605913 -1.987017 -0.681186
H  -0.80975 -0.869295 -1.769466
H  4.923476 1.314629 -0.933933
H  4.030979 1.733029 0.508091
H  6.458787 -0.142941 0.431146
H  6.487259 1.538343 0.948324
H  5.613012 0.348508 1.895169
H  -3.676513 2.897643 -1.039307
H  -4.68156 1.771357 1.097417
elementType: S O N C H
totalener: -958.86354242 hartree
nucrepener: 988.87273939 hartree
electener: -1947.73628181 hartree
oneelecener: -3272.17012298 hartree
twoeener: 1324.43384117 hartree
cpcmener: -0.02057488 hartree
kineticenergy: 955.50926432 hartree
xcener: -75.344466623183 hartree
chargesum: -0.0000000
charge: 0.114210 -0.550472 -0.073173 -0.165593 -0.150785 -0.140992 -0.094813 -0.124177 -0.087681 -0.110088 -0.273767 0.319741 -0.271525 -0.069210 0.076195 0.076273 0.081791 0.079337 0.082902 0.068885 0.074793 0.071852 0.072283 0.066164 0.124403 0.099885 0.070167 0.054821 0.079395 0.090662 0.076874 0.159590 0.172053
qa: 0.1142 -0.5505 -0.0732 -0.1656 -0.1508 -0.1410 -0.0948 -0.1242 -0.0877 -0.1101 -0.2738 0.3197 -0.2715 -0.0692 0.0762 0.0763 0.0818 0.0793 0.0829 0.0689 0.0748 0.0719 0.0723 0.0662 0.1244 0.0999 0.0702 0.0548 0.0794 0.0907 0.0769 0.1596 0.1721
va: 2.5522 1.9642 3.0863 3.9216 3.8852 3.8537 3.8158 3.8638 3.7983 3.8989 3.9287 4.2100 3.9173 3.9938 1.0080 1.0063 1.0123 1.0017 1.0099 1.0015 1.0147 1.0194 1.0089 1.0090 1.0032 1.0306 1.0054 1.0085 1.0005 1.0043 1.0002 0.9984 0.9863
dispcorr: -0.012462894 hartree
energy: -958.876005316816
dipole: 35.03431 -35.81481 -0.78050 -6.16991 5.36905 -0.80086 4.59175 -2.83431 1.75744
magnitude: 2.08306 au
magnitude: 5.29473 debye
