program: Orca
programVersion: 4.2.1
elementType: S O N C C C C C C C C C C C H H H H H H H H H H H H H H H H H H H
charge: 0
multiplicity: 1
keywords: wb97x-d3
keywords: def2-TZVPP
keywords: def2/J RIJCOSX GRIDX6 NOFINALGRIDX
keywords: grid4 nofinalgrid
keywords: scfconv7
keywords: smallprint printgap noloewdin
keywords: NOSOSCF
formula: C11H19NOS
InChI: InChI=1/C11H19NOS/c1-2-3-4-5-6-7-9-12-11(13)8-10-14-12/h8,10H,2-7,9H2,1H3
33 atoms
S  -1.878281 0.184509 -1.597449
O  -1.14509 0.73848 2.055144
N  -1.766472 -0.188389 0.050896
C  1.295501 -1.297964 -0.185009
C  0.465636 -2.305378 0.605447
C  2.663432 -1.052457 0.43824
C  -0.943567 -2.557704 0.068779
C  3.502379 -0.007809 -0.293922
C  -2.000621 -1.548884 0.500667
C  2.881609 1.386522 -0.37383
C  2.543733 1.994518 0.979938
C  -1.315528 0.837807 0.84642
C  -1.087341 2.006213 0.007078
C  -1.340043 1.782433 -1.291277
H  0.764374 -0.349196 -0.267104
H  1.41977 -1.658584 -1.21218
H  0.40088 -1.986872 1.651286
H  1.005224 -3.257181 0.617877
H  3.221429 -1.994128 0.467229
H  2.535042 -0.755397 1.484219
H  -1.298812 -3.52636 0.429774
H  -0.923578 -2.642827 -1.022865
H  3.710536 -0.360844 -1.309326
H  4.475907 0.068635 0.201511
H  -2.054748 -1.504516 1.588127
H  -2.984779 -1.867703 0.150645
H  3.5821 2.044184 -0.896344
H  1.981262 1.364589 -0.994977
H  1.741577 1.457459 1.489444
H  3.411314 1.993652 1.644444
H  2.217385 3.030595 0.874736
H  -0.739098 2.944281 0.412107
H  -1.249161 2.477293 -2.113842
elementType: S O N C H
totalener: -958.86160216 hartree
nucrepener: 1080.13936537 hartree
electener: -2039.00096752 hartree
oneelecener: -3454.96619058 hartree
twoeener: 1415.96522306 hartree
cpcmener: -0.01921216 hartree
kineticenergy: 955.50597312 hartree
xcener: -75.346833033899 hartree
chargesum: 0.0000000
charge: 0.111371 -0.533797 -0.069790 -0.079204 -0.102878 -0.140794 -0.140718 -0.145294 -0.094585 -0.106901 -0.287534 0.310405 -0.288300 -0.037695 -0.015388 0.073877 0.063856 0.082965 0.077421 0.068767 0.091475 0.073176 0.067960 0.076061 0.100007 0.130216 0.077071 0.052291 0.066200 0.096074 0.095688 0.154047 0.173949
qa: 0.1114 -0.5338 -0.0698 -0.0792 -0.1029 -0.1408 -0.1407 -0.1453 -0.0946 -0.1069 -0.2875 0.3104 -0.2883 -0.0377 -0.0154 0.0739 0.0639 0.0830 0.0774 0.0688 0.0915 0.0732 0.0680 0.0761 0.1000 0.1302 0.0771 0.0523 0.0662 0.0961 0.0957 0.1540 0.1739
va: 2.5554 1.9769 3.0803 3.8525 3.8404 3.9073 3.8857 3.9128 3.8433 3.8501 3.9157 4.1714 3.9139 3.9675 1.0277 1.0159 1.0193 1.0071 1.0117 1.0008 1.0146 1.0108 1.0108 1.0077 1.0290 1.0018 1.0076 1.0051 1.0102 1.0052 1.0038 1.0026 0.9845
dispcorr: -0.016933317 hartree
energy: -958.878535475297
dipole: 20.08623 -20.33414 -0.24791 -4.35330 4.01531 -0.33799 2.97028 -5.01478 -2.04450
magnitude: 2.08703 au
magnitude: 5.30480 debye
