program: Orca
programVersion: 4.2.1
elementType: S O N C C C C C C C C C C C H H H H H H H H H H H H H H H H H H H
charge: 0
multiplicity: 1
keywords: wb97x-d3
keywords: def2-TZVPP
keywords: def2/J RIJCOSX GRIDX6 NOFINALGRIDX
keywords: grid4 nofinalgrid
keywords: scfconv7
keywords: smallprint printgap noloewdin
keywords: NOSOSCF
formula: C11H19NOS
InChI: InChI=1/C11H19NOS/c1-2-3-4-5-6-7-9-12-11(13)8-10-14-12/h8,10H,2-7,9H2,1H3
33 atoms
S  -3.112692 -0.368501 0.795157
O  -1.280376 1.410221 -1.972579
N  -2.159832 -0.197515 -0.594565
C  1.777903 -1.665629 0.858597
C  0.677337 -1.011226 0.031285
C  2.865054 -0.698726 1.318875
C  -0.448178 -1.975968 -0.314248
C  3.688128 -0.095319 0.186386
C  -1.530553 -1.36268 -1.190816
C  4.825157 0.79129 0.67844
C  5.643448 1.388484 -0.456029
C  -1.959653 1.098909 -1.002351
C  -2.683756 1.983345 -0.10019
C  -3.320736 1.329729 0.882966
H  2.234511 -2.479201 0.283763
H  1.327091 -2.135377 1.739019
H  1.091101 -0.601154 -0.894733
H  0.276471 -0.158646 0.590023
H  3.537425 -1.224354 2.00478
H  2.40712 0.105873 1.905422
H  -0.891361 -2.378334 0.603106
H  -0.048922 -2.83883 -0.855194
H  3.043473 0.490842 -0.47636
H  4.099889 -0.902852 -0.430235
H  -2.299758 -2.100956 -1.427418
H  -1.109081 -1.029676 -2.139035
H  4.416536 1.59682 1.297036
H  5.48135 0.210412 1.334434
H  6.094721 0.609208 -1.073939
H  5.026024 2.007405 -1.110531
H  6.453033 2.016813 -0.080873
H  -2.6870 3.055352 -0.226344
H  -3.922796 1.749494 1.675746
elementType: S O N C H
totalener: -958.86570036 hartree
nucrepener: 1001.38497598 hartree
electener: -1960.25067634 hartree
oneelecener: -3297.39890504 hartree
twoeener: 1337.14822870 hartree
cpcmener: -0.02045611 hartree
kineticenergy: 955.51534333 hartree
xcener: -75.344253289621 hartree
chargesum: -0.0000000
charge: 0.114707 -0.544098 -0.078369 -0.132792 -0.099684 -0.128796 -0.131316 -0.106639 -0.092865 -0.086533 -0.276685 0.305177 -0.261152 -0.066207 0.065562 0.072887 0.070519 0.058106 0.071381 0.061251 0.071901 0.080704 0.058489 0.055917 0.131127 0.103116 0.054987 0.053739 0.076978 0.077117 0.090351 0.158044 0.173075
qa: 0.1147 -0.5441 -0.0784 -0.1328 -0.0997 -0.1288 -0.1313 -0.1066 -0.0929 -0.0865 -0.2767 0.3052 -0.2612 -0.0662 0.0656 0.0729 0.0705 0.0581 0.0714 0.0613 0.0719 0.0807 0.0585 0.0559 0.1311 0.1031 0.0550 0.0537 0.0770 0.0771 0.0904 0.1580 0.1731
va: 2.5580 1.9696 3.0630 3.9069 3.8068 3.8951 3.8617 3.8600 3.8270 3.8843 3.9446 4.2126 3.9168 3.9959 1.0096 1.0099 1.0169 1.0145 1.0112 1.0094 1.0105 1.0193 1.0082 1.0080 1.0017 1.0275 1.0059 1.0078 1.0008 1.0013 1.0041 0.9993 0.9855
dispcorr: -0.012679832 hartree
energy: -958.878380194767
dipole: 32.55537 -33.45897 -0.90360 -3.83975 2.87985 -0.95990 2.57274 -0.93189 1.64085
magnitude: 2.10482 au
magnitude: 5.35003 debye
