program: Orca
programVersion: 4.2.1
elementType: S O N C C C C C C C C C C C H H H H H H H H H H H H H H H H H H H
charge: 0
multiplicity: 1
keywords: wb97x-d3
keywords: def2-TZVPP
keywords: def2/J RIJCOSX GRIDX6 NOFINALGRIDX
keywords: grid4 nofinalgrid
keywords: scfconv7
keywords: smallprint printgap noloewdin
keywords: NOSOSCF
formula: C11H19NOS
InChI: InChI=1/C11H19NOS/c1-2-3-4-5-6-7-9-12-11(13)8-10-14-12/h8,10H,2-7,9H2,1H3
33 atoms
S  -2.640539 0.026333 1.058408
O  -1.38132 0.955353 -2.361646
N  -1.969466 -0.19864 -0.478705
C  1.928975 -2.035271 0.882767
C  0.447004 -1.713473 0.70454
C  2.90015 -1.068061 0.207295
C  -0.009049 -1.710471 -0.74843
C  2.735532 0.384526 0.6408
C  -1.50653 -1.503068 -0.925195
C  3.791252 1.328321 0.069121
C  5.195828 1.090859 0.606294
C  -1.854885 0.942844 -1.231341
C  -2.379048 2.060898 -0.461625
C  -2.819786 1.702709 0.754565
H  2.121172 -3.046427 0.509765
H  2.150004 -2.064001 1.954397
H  0.224719 -0.749988 1.171575
H  -0.137058 -2.454497 1.260464
H  2.802382 -1.131302 -0.881546
H  3.915641 -1.407743 0.429503
H  0.23974 -2.670406 -1.211398
H  0.522564 -0.948192 -1.323583
H  2.752484 0.444832 1.73544
H  1.748883 0.746666 0.336587
H  -2.066862 -2.268275 -0.384625
H  -1.782199 -1.603564 -1.975389
H  3.796877 1.24829 -1.022752
H  3.499156 2.358354 0.29133
H  5.22246 1.178928 1.694904
H  5.577942 0.101806 0.348718
H  5.900754 1.820115 0.203399
H  -2.401641 3.067629 -0.851145
H  -3.25099 2.336084 1.516326
elementType: S O N C H
totalener: -958.86280706 hartree
nucrepener: 1025.90498579 hartree
electener: -1984.76779285 hartree
oneelecener: -3346.39636736 hartree
twoeener: 1361.62857450 hartree
cpcmener: -0.02057015 hartree
kineticenergy: 955.50896340 hartree
xcener: -75.345710274730 hartree
chargesum: 0.0000000
charge: 0.116584 -0.550791 -0.065408 -0.172544 -0.141327 -0.139854 -0.095566 -0.114275 -0.107168 -0.111214 -0.272836 0.313395 -0.270917 -0.059762 0.076221 0.076645 0.061248 0.089915 0.069601 0.080895 0.082449 0.071706 0.065833 0.064848 0.117777 0.112489 0.055375 0.069502 0.078558 0.075703 0.091423 0.158363 0.173134
qa: 0.1166 -0.5508 -0.0654 -0.1725 -0.1413 -0.1399 -0.0956 -0.1143 -0.1072 -0.1112 -0.2728 0.3134 -0.2709 -0.0598 0.0762 0.0766 0.0612 0.0899 0.0696 0.0809 0.0824 0.0717 0.0658 0.0648 0.1178 0.1125 0.0554 0.0695 0.0786 0.0757 0.0914 0.1584 0.1731
va: 2.5566 1.9590 3.0578 3.9449 3.8517 3.8546 3.7649 3.8631 3.8872 3.9042 3.9297 4.1977 3.9296 3.9773 1.0080 1.0067 1.0062 1.0079 1.0025 1.0114 1.0175 1.0259 1.0088 1.0110 1.0022 1.0186 1.0081 1.0052 1.0004 1.0016 1.0040 0.9998 0.9853
dispcorr: -0.013773294 hartree
energy: -958.876580354743
dipole: 29.14291 -29.74918 -0.60627 -4.88613 4.41581 -0.47032 3.55995 -1.61815 1.94180
magnitude: 2.08791 au
magnitude: 5.30704 debye
