program: Gaussian 09
title: 000058982
version: EM64L-G09RevD.01
frameworkgroup: C1[X(C15H32Cl2N2)]
method: RPBEPBE
basis: SDD
operation: Freq
keyword: #p
keyword: freq=noraman
keyword: PBEPBE/SDD
title: #p freq=noraman PBEPBE/SDD
converged: YES YES NO NO
title: Mulliken charges:
elementType: Cl Cl N N C C C C C C C C C C C C C C C H H H H H H H H H H H H H H H H H H H H H H H H H H H H H H H H
charge: -0.091017 -0.095911 -0.093244 -0.093188 -0.384162 -0.386948 -0.385461 -0.369918 -0.370181 -0.393076 -0.369576 -0.369688 -0.387549 -0.314330 -0.319185 -0.638401 -0.639315 -0.565630 -0.571359 0.193402 0.195234 0.198539 0.193349 0.197437 0.193974 0.190340 0.192336 0.191174 0.189791 0.199367 0.212846 0.211611 0.196002 0.210536 0.188236 0.209811 0.189694 0.220756 0.226887 0.229368 0.229416 0.226871 0.194675 0.232096 0.224757 0.199718 0.231463 0.270707 0.262640 0.260777 0.274328
chargesum: 0.00000
title: Mulliken charges with hydrogens summed into heavy atoms:
elementType: Cl Cl N N C C C C C C C C C C C C C C C
charge: -0.091017 -0.095911 -0.093244 -0.093188 0.004474 0.004940 0.005949 0.012759 0.010784 0.019138 0.038037 0.029084 0.011956 0.133313 0.139599 0.015242 0.016623 -0.032282 -0.036254
polarizability: 2.56566770e+02 -1.76130878e+01 1.97290511e+02 -1.25793532e+00 9.23060722e-01 1.52329818e+02
1716.lowfreq: -11.7547 -1.4123 -0.0011 0.0014 0.0020 2.2809 8.0105 11.2554 14.5121
frequency: 5.6001 9.5841 13.8175 24.3925 29.8732 38.4098 50.7349 67.1914 78.2722 85.4252 89.5854 93.2996 106.9348 123.9606 132.8404 138.5133 145.4843 153.5225 167.7650 173.1320 208.6365 221.8390 233.7436 255.0639 276.0071 304.5403 340.3845 353.9390 377.2258 405.6864 414.3088 456.7346 477.5503 501.6741 524.1774 641.0441 651.7962 718.5747 725.4829 739.8145 765.3548 768.7363 775.8024 812.4536 820.9666 823.8170 874.4079 943.6951 982.2958 986.4550 995.0975 1001.9251 1007.6737 1016.6437 1030.6933 1042.0923 1054.0697 1062.9957 1069.2046 1075.9140 1078.0461 1080.1210 1088.9529 1096.0054 1099.4350 1102.0118 1104.9120 1137.1457 1139.5959 1192.9383 1196.2436 1221.1792 1221.4907 1235.0151 1238.4923 1248.3167 1249.7479 1253.8860 1256.2879 1275.9585 1277.0099 1281.3947 1285.9609 1290.5829 1294.4966 1297.4085 1307.0581 1315.2342 1318.7688 1341.6076 1354.9377 1355.2682 1357.0184 1357.8133 1370.4255 1376.3492 1434.5243 1435.3421 1449.1520 1449.9706 1459.5039 1460.6724 1462.5801 1464.3285 1465.9092 1469.4147 1470.8738 1473.4569 1477.1536 1478.3092 1481.2524 1484.1859 1485.9324 1489.2698 1490.3022 2843.3459 2848.8733 2866.4747 2872.3608 2926.1903 2949.3871 2949.7089 2951.6036 2955.8720 2956.1850 2962.9924 2971.9389 2978.6777 2983.4780 2988.8468 2997.8454 3007.5203 3009.0676 3016.7856 3020.5490 3032.5908 3033.2553 3044.3455 3048.0966 3050.0077 3053.9119 3065.7739 3066.1523 3076.4312 3087.4811 3154.2997 3154.8888
redmass: 6.1358 7.1174 5.9348 3.6205 2.0786 3.0922 3.9543 2.5171 2.3621 2.6548 1.9775 2.9583 2.7843 2.1279 2.4665 3.1436 2.0890 2.4196 2.7190 1.9420 1.6999 1.7554 1.8703 3.4485 3.9421 3.1069 3.6009 2.9740 3.0576 2.6786 3.0789 2.6110 2.9991 3.0360 3.0307 6.3235 6.1424 1.0618 1.0778 1.1041 1.1435 1.1475 1.1438 1.2589 4.2865 4.2670 1.2636 1.2521 3.0134 3.2848 1.6841 1.6902 1.1798 2.2784 2.5918 3.4673 2.6422 3.1078 2.9817 2.3720 2.3371 2.0795 2.2738 1.6309 1.5747 1.7452 1.4025 1.5601 1.4544 1.8089 1.3667 1.6000 1.6354 1.4511 1.2055 1.4832 1.4132 1.4342 1.5691 1.0344 1.2383 1.2987 1.1139 1.1492 1.1841 1.3350 1.2253 1.3662 1.4178 1.4569 1.6030 1.5937 1.3201 1.4178 1.4124 1.4172 1.1533 1.1499 1.0974 1.0930 1.0746 1.0773 1.0726 1.0596 1.0835 1.0576 1.0610 1.0869 1.0787 1.0796 1.0888 1.0764 1.0838 1.0787 1.0831 1.0703 1.0694 1.0565 1.0561 1.0693 1.0590 1.0586 1.0591 1.0596 1.0657 1.0590 1.0609 1.0607 1.0958 1.0978 1.1000 1.0892 1.0883 1.1020 1.0748 1.0991 1.0781 1.1006 1.0996 1.1025 1.0923 1.0568 1.0576 1.1009 1.1004 1.1125 1.1119
irintensity: 1.2762 0.7267 0.0360 0.1934 0.0565 0.3449 0.6501 0.1645 0.3492 2.4000 1.4438 1.8447 0.3544 0.3606 0.3613 0.2556 0.1437 1.7006 2.9380 1.1716 0.1458 3.8984 2.6036 0.4955 3.1309 0.6833 12.8835 5.0553 6.5667 0.8117 0.5233 0.6634 4.0967 1.6248 3.0738 115.7291 105.3171 13.7593 0.0521 4.0143 4.8002 5.2589 6.0315 2.3498 4.4701 21.0439 0.1399 1.3133 11.3567 0.4742 0.2162 8.9745 2.0316 8.8500 44.1539 17.1850 1.7553 4.6151 6.8793 26.7796 0.5366 0.6779 27.3323 28.8707 10.7516 3.0034 17.6610 7.7708 2.7225 7.0996 16.6459 5.1030 8.0150 33.0283 10.3327 2.1004 0.8262 1.7231 19.5299 0.7926 4.2171 1.5374 4.6819 1.5690 4.3542 13.3030 3.4285 2.2935 7.1484 0.0845 0.2218 1.0099 1.7034 1.2993 10.5206 9.8705 3.6719 3.2989 7.2551 5.2864 0.2676 0.0735 0.6299 0.4625 5.2140 8.9888 18.8967 11.4230 3.9768 6.0266 6.8651 8.1650 5.5545 3.6897 37.8537 73.7738 80.0899 137.3952 163.3447 63.7763 1.3977 0.1304 6.7911 1.2417 44.8133 97.0894 73.6917 49.2506 2.9231 0.0224 6.5958 1.2327 36.7601 0.0789 38.5486 13.4674 38.1733 39.4755 10.1472 221.9790 32.2052 24.5475 26.3884 38.3210 39.9238 19.4985 18.2225
temp: 298.150 k
press: 1.00000 atm
elementType: 17 17 7 7 6 6 6 6 6 6 6 6 6 6 6 6 6 6 6 1 1 1 1 1 1 1 1 1 1 1 1 1 1 1 1 1 1 1 1 1 1 1 1 1 1 1 1 1 1 1 1
symmnumber: 1
zpe: 1184129.8 jmol-1
zpe.correction: 0.451011 hartree
zpe.thermalcorrener: 0.476906 hartree
zpe.thermalcorrenthalpy: 0.477851 hartree
zpe.thermalcorrgfe: 0.386343 hartree
zpe.sumelectzpe: -1618.785309 hartree
zpe.sumelectthermal: -1618.759414 hartree
zpe.sumelectthermalent: -1618.758470 hartree
zpe.sumelectthermalfe: -1618.849978 hartree
dipole: -1.1748 -1.1969 1.1530
dipole: 2.0352
quadrupole: -188.2590 -138.0308 -134.8716
quadrupole: 38.1870 3.2476 1.0351
quadrupole: -34.5385 15.6897 18.8489 38.1870 3.2476 1.0351
hfenergy: -1619.2363203 hartree
pointgroup: C01 [X(C15H32Cl2N2)]
dipole: 0.4816311 -0.3959421 -0.5023943 debye
polarizability: 254.7011263|20.4769182|198.8293789|0.3580315|3.9402537|152.6565929 unknown
InChI: InChI=1S/C15H32Cl2N2/c1-18(14-10-16)12-8-6-4-3-5-7-9-13-19(2)15-11-17/h3-15H2,1-2H3
charge 0 multiplicity 1
51 atoms
Cl -9.294654 -1.776185 0.501673
Cl 7.87382 2.903678 0.632644
N  -6.221768 0.978535 0.082308
N  6.430015 -0.936724 -0.010124
C  0.02084 -0.527872 -0.517969
C  -1.166979 0.210056 0.139547
C  1.383765 -0.186514 0.125306
C  -2.525224 -0.1044 -0.527001
C  2.570458 -0.928152 -0.530295
C  -3.709663 0.638107 0.132528
C  3.936474 -0.548221 0.084781
C  -5.051465 0.335161 -0.565907
C  5.10895 -1.310258 -0.567566
C  -7.501544 0.286423 -0.198685
C  6.892045 0.432635 -0.328341
C  -6.271951 2.442881 -0.098024
C  7.472334 -1.968402 -0.168829
C  -7.714121 -0.788322 0.876659
C  7.198415 1.158373 0.988901
H  0.054282 -0.276394 -1.598888
H  -0.149678 -1.623344 -0.459307
H  -1.215331 -0.056565 1.21582
H  -0.98473 1.304436 0.098668
H  1.351764 -0.429907 1.207703
H  1.555157 0.908298 0.058244
H  -2.473116 0.164096 -1.603227
H  -2.707197 -1.199002 -0.488055
H  2.413728 -2.023349 -0.436468
H  2.581554 -0.708016 -1.618575
H  -3.504574 1.726939 0.112193
H  -3.795794 0.349937 1.198386
H  3.940285 -0.761387 1.171684
H  4.088402 0.545226 -0.024473
H  -5.213112 -0.760121 -0.548761
H  -4.980338 0.629033 -1.645688
H  4.968057 -2.393989 -0.388194
H  5.0709 -1.163721 -1.67794
H  -7.53129 -0.178534 -1.210322
H  -8.335574 1.008882 -0.152167
H  6.114001 0.990128 -0.881102
H  7.798285 0.425918 -0.970584
H  -7.133968 2.857191 0.453049
H  -6.36015 2.75211 -1.16968
H  -5.360732 2.908411 0.314928
H  8.392937 -1.65883 0.35763
H  7.74177 -2.168935 -1.235445
H  7.133236 -2.917259 0.283954
H  -7.861545 -0.346634 1.871855
H  -6.903286 -1.531365 0.89834
H  7.982632 0.653313 1.571842
H  6.295276 1.303838 1.598073
