program: Orca
programVersion: 4.2.1
elementType: S O N C C C C C C C C C C C H H H H H H H H H H H H H H H H H H H
charge: 0
multiplicity: 1
keywords: wb97x-d3
keywords: def2-TZVPP
keywords: def2/J RIJCOSX GRIDX6 NOFINALGRIDX
keywords: grid4 nofinalgrid
keywords: scfconv7
keywords: smallprint printgap noloewdin
keywords: NOSOSCF
formula: C11H19NOS
InChI: InChI=1/C11H19NOS/c1-2-3-4-5-6-7-9-12-11(13)8-10-14-12/h8,10H,2-7,9H2,1H3
33 atoms
S  -3.448191 -0.345748 0.802448
O  -2.048638 1.225213 -2.320588
N  -2.315398 -0.017133 -0.414979
C  2.1447 -0.172397 -0.410994
C  1.292368 -0.405267 0.833364
C  3.599387 -0.614434 -0.260201
C  -0.12545 0.150607 0.731087
C  4.399875 0.211548 0.742648
C  -0.968364 -0.549943 -0.326769
C  5.893912 -0.102695 0.756066
C  6.229428 -1.518656 1.203719
C  -2.746154 0.854761 -1.384629
C  -4.123135 1.227374 -1.092564
C  -4.596487 0.665193 0.029565
H  2.116223 0.890645 -0.675109
H  1.709358 -0.705887 -1.26085
H  1.768781 0.06038 1.699406
H  1.251428 -1.477783 1.053121
H  4.086962 -0.545189 -1.238191
H  3.624997 -1.673698 0.014595
H  -0.089152 1.221177 0.509709
H  -0.615114 0.050117 1.704182
H  4.000651 0.073843 1.752373
H  4.267264 1.272834 0.507493
H  -1.024007 -1.622657 -0.127188
H  -0.533136 -0.436293 -1.318721
H  6.31008 0.073142 -0.241012
H  6.395191 0.606618 1.420539
H  5.836946 -2.272232 0.519423
H  7.309156 -1.667308 1.258992
H  5.819873 -1.728373 2.194431
H  -4.68417 1.895995 -1.727631
H  -5.578892 0.781117 0.463571
elementType: S O N C H
totalener: -958.86318006 hartree
nucrepener: 972.52100155 hartree
electener: -1931.38418161 hartree
oneelecener: -3239.48058385 hartree
twoeener: 1308.09640223 hartree
cpcmener: -0.02057105 hartree
kineticenergy: 955.50613313 hartree
xcener: -75.343606913155 hartree
chargesum: -0.0000000
charge: 0.115341 -0.549149 -0.074497 -0.132821 -0.134920 -0.142033 -0.116904 -0.111938 -0.077724 -0.118063 -0.275191 0.313614 -0.266182 -0.070176 0.066692 0.075020 0.079201 0.067496 0.075729 0.063229 0.079269 0.077379 0.060387 0.070288 0.126057 0.093887 0.055643 0.069346 0.079182 0.091560 0.079375 0.159394 0.171507
qa: 0.1153 -0.5491 -0.0745 -0.1328 -0.1349 -0.1420 -0.1169 -0.1119 -0.0777 -0.1181 -0.2752 0.3136 -0.2662 -0.0702 0.0667 0.0750 0.0792 0.0675 0.0757 0.0632 0.0793 0.0774 0.0604 0.0703 0.1261 0.0939 0.0556 0.0693 0.0792 0.0916 0.0794 0.1594 0.1715
va: 2.5530 1.9670 3.0951 3.9050 3.8931 3.8986 3.8785 3.8630 3.7882 3.9027 3.9265 4.2109 3.9166 3.9945 1.0084 1.0118 1.0113 1.0090 1.0077 1.0067 1.0146 1.0194 1.0093 1.0109 1.0008 1.0346 1.0086 1.0061 0.9991 1.0044 1.0006 0.9983 0.9864
dispcorr: -0.012170076 hartree
energy: -958.875350134069
dipole: 39.54513 -40.25127 -0.70614 -4.85237 4.09667 -0.75569 6.11264 -4.32233 1.79031
magnitude: 2.06759 au
magnitude: 5.25539 debye
