program: Orca
programVersion: 4.2.1
elementType: S O N C C C C C C C C C C C H H H H H H H H H H H H H H H H H H H
charge: 0
multiplicity: 1
keywords: wb97x-d3
keywords: def2-TZVPP
keywords: def2/J RIJCOSX GRIDX6 NOFINALGRIDX
keywords: grid4 nofinalgrid
keywords: scfconv7
keywords: smallprint printgap noloewdin
keywords: NOSOSCF
formula: C11H19NOS
InChI: InChI=1/C11H19NOS/c1-2-3-4-5-6-7-9-12-11(13)8-10-14-12/h8,10H,2-7,9H2,1H3
33 atoms
S  -2.327399 1.769217 0.252295
O  -3.341113 -1.687248 -0.84137
N  -2.158397 0.114993 -0.068066
C  2.258154 -0.665365 0.136952
C  1.38182 -0.949227 -1.079002
C  3.602707 -1.379758 0.059153
C  0.068801 -0.174025 -1.116315
C  4.463876 -1.238952 1.311766
C  -0.859262 -0.523447 0.039632
C  4.869352 0.188228 1.672615
C  5.68474 0.888646 0.595445
C  -3.294724 -0.504368 -0.526907
C  -4.370774 0.475466 -0.566124
C  -3.98369 1.701393 -0.182269
H  1.747561 -0.976426 1.05445
H  2.407985 0.416011 0.223939
H  1.170052 -2.022463 -1.133443
H  1.944862 -0.707754 -1.985503
H  4.152811 -1.024981 -0.818524
H  3.425308 -2.445926 -0.116656
H  -0.449091 -0.388229 -2.055148
H  0.278077 0.900803 -1.113553
H  5.370178 -1.84011 1.183443
H  3.929336 -1.680165 2.159454
H  -0.421811 -0.253099 1.002725
H  -1.042719 -1.598115 0.068818
H  3.982328 0.784761 1.904973
H  5.453092 0.156536 2.597104
H  6.023153 1.869773 0.932781
H  6.572817 0.310141 0.330582
H  5.111546 1.044894 -0.320106
H  -5.370294 0.219136 -0.88272
H  -4.583345 2.598084 -0.125392
elementType: S O N C H
totalener: -958.86358645 hartree
nucrepener: 980.49558589 hartree
electener: -1939.35917234 hartree
oneelecener: -3255.23413489 hartree
twoeener: 1315.87496254 hartree
cpcmener: -0.02045859 hartree
kineticenergy: 955.50858135 hartree
xcener: -75.344202007328 hartree
chargesum: -0.0000000
charge: 0.114132 -0.550818 -0.073303 -0.123553 -0.139807 -0.139517 -0.111559 -0.146690 -0.082290 -0.117513 -0.273638 0.317470 -0.268983 -0.071675 0.065144 0.063820 0.072726 0.074335 0.070044 0.075690 0.090318 0.069989 0.075542 0.069406 0.124548 0.099914 0.060272 0.071968 0.092549 0.082552 0.077054 0.159710 0.172164
qa: 0.1141 -0.5508 -0.0733 -0.1236 -0.1398 -0.1395 -0.1116 -0.1467 -0.0823 -0.1175 -0.2736 0.3175 -0.2690 -0.0717 0.0651 0.0638 0.0727 0.0743 0.0700 0.0757 0.0903 0.0700 0.0755 0.0694 0.1245 0.0999 0.0603 0.0720 0.0925 0.0826 0.0771 0.1597 0.1722
va: 2.5540 1.9627 3.0873 3.8476 3.9160 3.8716 3.8741 3.8971 3.7904 3.8767 3.9278 4.2100 3.9178 3.9955 1.0112 1.0056 1.0087 1.0097 1.0025 1.0111 1.0170 1.0182 1.0074 1.0106 1.0000 1.0293 1.0020 1.0075 1.0049 1.0009 0.9978 0.9983 0.9865
dispcorr: -0.012402214 hartree
energy: -958.875988663835
dipole: 37.28048 -36.67218 0.60829 -4.46460 6.38858 1.92398 2.64492 -2.11472 0.53020
magnitude: 2.08635 au
magnitude: 5.30307 debye
