program: Orca
programVersion: 4.2.1
elementType: S O N C C C C C C C C C C C H H H H H H H H H H H H H H H H H H H
charge: 0
multiplicity: 1
keywords: wb97x-d3
keywords: def2-TZVPP
keywords: def2/J RIJCOSX GRIDX6 NOFINALGRIDX
keywords: grid4 nofinalgrid
keywords: scfconv7
keywords: smallprint printgap noloewdin
keywords: NOSOSCF
formula: C11H19NOS
InChI: InChI=1/C11H19NOS/c1-2-3-4-5-6-7-9-12-11(13)8-10-14-12/h8,10H,2-7,9H2,1H3
33 atoms
S  -2.65563 0.177043 -1.220464
O  -0.727235 0.612858 1.986827
N  -1.868921 -0.282953 0.208154
C  1.468387 -1.855946 0.512013
C  0.558279 -1.794897 -0.70956
C  2.818318 -1.172235 0.312748
C  -0.81525 -2.420446 -0.496636
C  2.730869 0.338906 0.123409
C  -1.693833 -1.691263 0.51507
C  4.097112 1.011929 0.077216
C  4.01118 2.516021 -0.132573
C  -1.335239 0.756183 0.933088
C  -1.627893 2.002322 0.239073
C  -2.314008 1.825813 -0.899628
H  1.634027 -2.906311 0.77284
H  0.975363 -1.402969 1.376359
H  1.047367 -2.310507 -1.541771
H  0.433387 -0.759636 -1.040583
H  3.33662 -1.618932 -0.54331
H  3.44625 -1.380955 1.185078
H  -0.711555 -3.452341 -0.148561
H  -1.339438 -2.4832 -1.455136
H  2.136619 0.771242 0.936525
H  2.190728 0.574182 -0.799281
H  -1.264189 -1.733735 1.514368
H  -2.673499 -2.169851 0.575676
H  4.636473 0.8040 1.006861
H  4.694834 0.565797 -0.724202
H  3.519779 2.759744 -1.076986
H  3.44191 2.997378 0.665541
H  5.000402 2.976629 -0.151546
H  -1.312576 2.960387 0.624108
H  -2.655624 2.5821 -1.591546
elementType: S O N C H
totalener: -958.86421866 hartree
nucrepener: 1044.25920808 hartree
electener: -2003.12342674 hartree
oneelecener: -3383.37432684 hartree
twoeener: 1380.25090010 hartree
cpcmener: -0.01888994 hartree
kineticenergy: 955.50914531 hartree
xcener: -75.345368891760 hartree
chargesum: 0.0000000
charge: 0.112497 -0.538167 -0.063010 -0.126955 -0.104817 -0.136847 -0.155307 -0.094340 -0.106522 -0.087911 -0.276212 0.298781 -0.263640 -0.060322 0.077032 0.062914 0.084721 0.053960 0.060264 0.069560 0.079280 0.088662 0.050590 0.050824 0.108434 0.133202 0.054675 0.054269 0.075970 0.077771 0.090010 0.158521 0.172114
qa: 0.1125 -0.5382 -0.0630 -0.1270 -0.1048 -0.1368 -0.1553 -0.0943 -0.1065 -0.0879 -0.2762 0.2988 -0.2636 -0.0603 0.0770 0.0629 0.0847 0.0540 0.0603 0.0696 0.0793 0.0887 0.0506 0.0508 0.1084 0.1332 0.0547 0.0543 0.0760 0.0778 0.0900 0.1585 0.1721
va: 2.5561 1.9721 3.0750 3.8619 3.8401 3.9135 3.9055 3.8532 3.8074 3.8924 3.9427 4.1990 3.9236 3.9887 1.0128 1.0308 1.0122 1.0148 1.0095 1.0098 1.0201 1.0058 1.0226 1.0072 1.0189 1.0018 1.0077 1.0060 1.0018 1.0010 1.0042 0.9996 0.9854
dispcorr: -0.014533090 hartree
energy: -958.878751752010
dipole: 25.06413 -25.99942 -0.93529 -3.23023 2.98567 -0.24457 -0.39515 -1.42260 -1.81775
magnitude: 2.05884 au
magnitude: 5.23315 debye
