program: Orca
programVersion: 4.2.1
elementType: S O N C C C C C C C C C C C H H H H H H H H H H H H H H H H H H H
charge: 0
multiplicity: 1
keywords: wb97x-d3
keywords: def2-TZVPP
keywords: def2/J RIJCOSX GRIDX6 NOFINALGRIDX
keywords: grid4 nofinalgrid
keywords: scfconv7
keywords: smallprint printgap noloewdin
keywords: NOSOSCF
formula: C11H19NOS
InChI: InChI=1/C11H19NOS/c1-2-3-4-5-6-7-9-12-11(13)8-10-14-12/h8,10H,2-7,9H2,1H3
33 atoms
S  -2.024704 1.776102 0.232058
O  -3.46311 -1.449751 -1.07286
N  -2.132256 0.109235 -0.047744
C  2.56777 -1.488739 -0.84308
C  1.299244 -1.571781 0.001868
C  3.296544 -0.146361 -0.796314
C  0.220173 -0.583335 -0.421973
C  3.742358 0.305907 0.591879
C  -1.061126 -0.774252 0.376066
C  4.724504 -0.640394 1.272239
C  5.247098 -0.097573 2.593443
C  -3.235363 -0.286534 -0.76387
C  -4.040509 0.889784 -1.059233
C  -3.504416 2.028023 -0.593391
H  2.311443 -1.709099 -1.884337
H  3.248328 -2.287104 -0.533702
H  1.538579 -1.4248 1.060186
H  0.899409 -2.587882 -0.07262
H  2.666308 0.631221 -1.238242
H  4.176363 -0.210749 -1.444852
H  0.000921 -0.708725 -1.486622
H  0.57939 0.442581 -0.29676
H  2.871861 0.453478 1.240562
H  4.208009 1.292711 0.500134
H  -0.880247 -0.628907 1.444007
H  -1.436565 -1.790455 0.25647
H  4.252002 -1.611433 1.446548
H  5.566045 -0.831295 0.598038
H  5.768868 0.851995 2.455976
H  4.434957 0.075425 3.302919
H  5.947883 -0.790155 3.0628
H  -4.969403 0.828268 -1.605585
H  -3.898177 3.030287 -0.680955
elementType: S O N C H
totalener: -958.86361512 hartree
nucrepener: 990.77572174 hartree
electener: -1949.63933686 hartree
oneelecener: -3275.75170382 hartree
twoeener: 1326.11236696 hartree
cpcmener: -0.02049845 hartree
kineticenergy: 955.51108386 hartree
xcener: -75.345484344105 hartree
chargesum: 0.0000000
charge: 0.113254 -0.549792 -0.069648 -0.167897 -0.142070 -0.160108 -0.099808 -0.125108 -0.086957 -0.089154 -0.279465 0.317403 -0.270756 -0.069422 0.080599 0.083559 0.069648 0.088511 0.078805 0.077904 0.081303 0.064172 0.061430 0.074282 0.126415 0.097247 0.057210 0.060027 0.077583 0.078418 0.090379 0.159500 0.172537
qa: 0.1133 -0.5498 -0.0696 -0.1679 -0.1421 -0.1601 -0.0998 -0.1251 -0.0870 -0.0892 -0.2795 0.3174 -0.2708 -0.0694 0.0806 0.0836 0.0696 0.0885 0.0788 0.0779 0.0813 0.0642 0.0614 0.0743 0.1264 0.0972 0.0572 0.0600 0.0776 0.0784 0.0904 0.1595 0.1725
va: 2.5543 1.9662 3.0840 3.8961 3.8798 3.8952 3.8415 3.8601 3.7955 3.8594 3.9484 4.2125 3.9143 3.9937 1.0091 1.0014 1.0052 1.0104 1.0019 1.0087 1.0169 1.0150 1.0021 1.0095 1.0004 1.0348 1.0045 1.0074 1.0016 1.0003 1.0036 0.9985 0.9861
dispcorr: -0.012637228 hartree
energy: -958.876252350824
dipole: 35.09535 -34.20314 0.89220 -6.60215 8.38322 1.78107 5.71626 -5.12966 0.58660
magnitude: 2.07661 au
magnitude: 5.27833 debye
