program: Orca
programVersion: 4.2.1
elementType: S O N C C C C C C C C C C C H H H H H H H H H H H H H H H H H H H
charge: 0
multiplicity: 1
keywords: wb97x-d3
keywords: def2-TZVPP
keywords: def2/J RIJCOSX GRIDX6 NOFINALGRIDX
keywords: grid4 nofinalgrid
keywords: scfconv7
keywords: smallprint printgap noloewdin
keywords: NOSOSCF
formula: C11H19NOS
InChI: InChI=1/C11H19NOS/c1-2-3-4-5-6-7-9-12-11(13)8-10-14-12/h8,10H,2-7,9H2,1H3
33 atoms
S  -1.354559 1.364594 -1.071796
O  -3.165478 -1.347826 0.800323
N  -1.868435 -0.201218 -0.690432
C  0.914531 -0.823304 0.835907
C  0.902297 -1.641833 -0.45468
C  2.319383 -0.496394 1.335294
C  -0.442115 -2.265545 -0.825241
C  3.159055 0.327822 0.365658
C  -1.459364 -1.346648 -1.487625
C  4.518008 0.712858 0.937657
C  5.374709 1.501996 -0.040673
C  -2.689105 -0.290468 0.403971
C  -2.873964 1.044136 0.954801
C  -2.222644 1.993827 0.265061
H  0.38747 -1.384271 1.61436
H  0.361023 0.110426 0.709258
H  1.622517 -2.458866 -0.339683
H  1.270781 -1.042298 -1.293429
H  2.847264 -1.428516 1.566766
H  2.236888 0.045855 2.282973
H  -0.888413 -2.738987 0.05223
H  -0.270189 -3.070685 -1.544907
H  2.60922 1.234255 0.086343
H  3.312932 -0.229835 -0.563727
H  -2.356802 -1.914352 -1.740085
H  -1.060923 -0.969663 -2.43113
H  4.37565 1.296286 1.852753
H  5.052407 -0.19409 1.238077
H  6.341936 1.762489 0.39242
H  5.568077 0.930051 -0.950765
H  4.887894 2.433409 -0.337443
H  -3.48555 1.22772 1.825454
H  -2.200917 3.056492 0.459294
elementType: S O N C H
totalener: -958.86215017 hartree
nucrepener: 1030.54982716 hartree
electener: -1989.41197733 hartree
oneelecener: -3355.56117899 hartree
twoeener: 1366.14920166 hartree
cpcmener: -0.02064904 hartree
kineticenergy: 955.50636846 hartree
xcener: -75.343992952025 hartree
chargesum: -0.0000000
charge: 0.111010 -0.545174 -0.060791 -0.127950 -0.146285 -0.130544 -0.102446 -0.098704 -0.112205 -0.088541 -0.277462 0.316236 -0.270778 -0.055065 0.079165 0.047588 0.082988 0.067823 0.064416 0.069055 0.074253 0.087700 0.051296 0.058181 0.113646 0.108410 0.055484 0.054451 0.090740 0.076283 0.077853 0.157680 0.171685
qa: 0.1110 -0.5452 -0.0608 -0.1280 -0.1463 -0.1305 -0.1024 -0.0987 -0.1122 -0.0885 -0.2775 0.3162 -0.2708 -0.0551 0.0792 0.0476 0.0830 0.0678 0.0644 0.0691 0.0743 0.0877 0.0513 0.0582 0.1136 0.1084 0.0555 0.0545 0.0907 0.0763 0.0779 0.1577 0.1717
va: 2.5468 1.9689 3.0509 3.8937 3.8672 3.9054 3.8044 3.8530 3.9193 3.8877 3.9450 4.1953 3.9231 3.9666 1.0145 1.0186 1.0064 1.0055 1.0098 1.0117 1.0295 1.0118 1.0110 1.0074 1.0122 1.0013 1.0076 1.0064 1.0042 1.0016 1.0005 1.0006 0.9854
dispcorr: -0.014141398 hartree
energy: -958.876291564329
dipole: 28.64197 -27.58262 1.05935 -3.23812 4.71323 1.47511 2.80831 -3.75591 -0.94761
magnitude: 2.04845 au
magnitude: 5.20674 debye
