program: Orca
programVersion: 4.2.1
elementType: S O N C C C C C C C C C C C H H H H H H H H H H H H H H H H H H H
charge: 0
multiplicity: 1
keywords: wb97x-d3
keywords: def2-TZVPP
keywords: def2/J RIJCOSX GRIDX6 NOFINALGRIDX
keywords: grid4 nofinalgrid
keywords: scfconv7
keywords: smallprint printgap noloewdin
keywords: NOSOSCF
formula: C11H19NOS
InChI: InChI=1/C11H19NOS/c1-2-3-4-5-6-7-9-12-11(13)8-10-14-12/h8,10H,2-7,9H2,1H3
33 atoms
S  -3.512091 -0.667915 -0.047913
O  -1.435873 2.46477 -0.292066
N  -2.153724 0.329334 0.126067
C  2.182297 -0.727257 0.447746
C  1.07551 -1.736354 0.160324
C  3.491329 -1.398016 0.847149
C  -0.211279 -1.123475 -0.382091
C  4.58923 -0.426194 1.27178
C  -0.904733 -0.216019 0.625141
C  5.03482 0.56805 0.201803
C  5.604017 -0.085609 -1.049147
C  -2.319028 1.615158 -0.326072
C  -3.681765 1.760766 -0.817042
C  -4.400114 0.631417 -0.725081
H  1.875919 -0.044255 1.247377
H  2.332631 -0.105247 -0.440666
H  0.85378 -2.308348 1.068115
H  1.440006 -2.464512 -0.570384
H  3.842749 -2.027754 0.022986
H  3.298477 -2.08401 1.678637
H  -0.892551 -1.929239 -0.671106
H  0.000982 -0.554762 -1.292229
H  5.460765 -1.001879 1.600743
H  4.247921 0.129163 2.151592
H  -0.281416 0.640573 0.879235
H  -1.09897 -0.751594 1.557755
H  4.202927 1.222632 -0.074785
H  5.792845 1.225369 0.636963
H  6.426223 -0.762414 -0.804724
H  4.854056 -0.665413 -1.590134
H  5.992254 0.661813 -1.74313
H  -4.053794 2.693206 -1.213702
H  -5.427983 0.474826 -1.01885
elementType: S O N C H
totalener: -958.86372284 hartree
nucrepener: 982.30574747 hartree
electener: -1941.16947031 hartree
oneelecener: -3259.08734288 hartree
twoeener: 1317.91787256 hartree
cpcmener: -0.02071685 hartree
kineticenergy: 955.50613625 hartree
xcener: -75.343945031971 hartree
chargesum: 0.0000000
charge: 0.115434 -0.551437 -0.072510 -0.125273 -0.135940 -0.138217 -0.112108 -0.148703 -0.077503 -0.118577 -0.274224 0.314479 -0.266709 -0.070403 0.066533 0.066601 0.068501 0.074710 0.069907 0.075457 0.078517 0.078587 0.075852 0.069803 0.092925 0.126078 0.062319 0.072301 0.081526 0.077415 0.093200 0.159426 0.172032
qa: 0.1154 -0.5514 -0.0725 -0.1253 -0.1359 -0.1382 -0.1121 -0.1487 -0.0775 -0.1186 -0.2742 0.3145 -0.2667 -0.0704 0.0665 0.0666 0.0685 0.0747 0.0699 0.0755 0.0785 0.0786 0.0759 0.0698 0.0929 0.1261 0.0623 0.0723 0.0815 0.0774 0.0932 0.1594 0.1720
va: 2.5549 1.9651 3.0967 3.8528 3.9043 3.8717 3.8781 3.8977 3.7857 3.8767 3.9284 4.2104 3.9158 3.9946 1.0088 1.0053 1.0101 1.0095 1.0023 1.0107 1.0205 1.0143 1.0070 1.0102 1.0362 1.0005 1.0020 1.0071 1.0009 0.9979 1.0046 0.9984 0.9863
dispcorr: -0.012376098 hartree
energy: -958.876098937501
dipole: 36.60944 -37.71400 -1.10456 -7.22620 5.46177 -1.76443 1.32935 -1.27807 0.05128
magnitude: 2.08228 au
magnitude: 5.29273 debye
