program: Orca
programVersion: 4.2.1
elementType: S O N C C C C C C C C C C C H H H H H H H H H H H H H H H H H H H
charge: 0
multiplicity: 1
keywords: wb97x-d3
keywords: def2-TZVPP
keywords: def2/J RIJCOSX GRIDX6 NOFINALGRIDX
keywords: grid4 nofinalgrid
keywords: scfconv7
keywords: smallprint printgap noloewdin
keywords: NOSOSCF
formula: C11H19NOS
InChI: InChI=1/C11H19NOS/c1-2-3-4-5-6-7-9-12-11(13)8-10-14-12/h8,10H,2-7,9H2,1H3
33 atoms
S  -1.747197 1.254933 -1.247187
O  -3.467782 -1.237579 0.992975
N  -2.188387 -0.266136 -0.644071
C  1.82303 -1.497747 0.773511
C  0.316101 -1.508021 0.527688
C  2.505587 -0.188729 0.391194
C  -0.067706 -1.517664 -0.945938
C  3.990807 -0.164742 0.729821
C  -1.570322 -1.464805 -1.183659
C  4.671037 1.147986 0.36195
C  6.152055 1.169199 0.708061
C  -3.055694 -0.235999 0.420706
C  -3.37833 1.153562 0.714143
C  -2.748174 2.023761 -0.088809
H  2.290785 -2.328966 0.234091
H  2.003618 -1.690112 1.835689
H  -0.124678 -0.63828 1.026249
H  -0.123827 -2.386481 1.009335
H  2.003362 0.638518 0.905657
H  2.383009 0.004443 -0.679239
H  0.302529 -2.43269 -1.416948
H  0.4149 -0.693723 -1.480211
H  4.495626 -0.990495 0.215801
H  4.122195 -0.351608 1.801574
H  -2.065375 -2.307468 -0.701394
H  -1.792437 -1.533336 -2.250621
H  4.544826 1.334344 -0.709288
H  4.165358 1.973427 0.87306
H  6.69488 0.378814 0.185215
H  6.614963 2.118879 0.434531
H  6.313295 1.023672 1.778377
H  -4.054307 1.430807 1.508915
H  -2.813562 3.102153 -0.077129
elementType: S O N C H
totalener: -958.86562398 hartree
nucrepener: 1000.35862251 hartree
electener: -1959.22424649 hartree
oneelecener: -3295.09183299 hartree
twoeener: 1335.86758650 hartree
cpcmener: -0.02081868 hartree
kineticenergy: 955.51106512 hartree
xcener: -75.343785910546 hartree
chargesum: -0.0000000
charge: 0.114751 -0.546567 -0.076008 -0.130666 -0.119016 -0.098442 -0.128459 -0.118369 -0.092980 -0.073147 -0.283441 0.305348 -0.262719 -0.065979 0.062353 0.073353 0.062790 0.085456 0.053679 0.055178 0.083195 0.071321 0.056341 0.056016 0.102677 0.129683 0.053513 0.053609 0.078156 0.089944 0.077762 0.158729 0.171938
qa: 0.1148 -0.5466 -0.0760 -0.1307 -0.1190 -0.0984 -0.1285 -0.1184 -0.0930 -0.0731 -0.2834 0.3053 -0.2627 -0.0660 0.0624 0.0734 0.0628 0.0855 0.0537 0.0552 0.0832 0.0713 0.0563 0.0560 0.1027 0.1297 0.0535 0.0536 0.0782 0.0899 0.0778 0.1587 0.1719
va: 2.5588 1.9670 3.0661 3.9088 3.8633 3.8628 3.8543 3.8945 3.8236 3.8701 3.9484 4.2144 3.9127 3.9978 1.0089 1.0091 1.0166 1.0150 1.0118 1.0117 1.0201 1.0059 1.0080 1.0093 1.0295 1.0011 1.0069 1.0065 1.0004 1.0043 1.0006 0.9986 0.9859
dispcorr: -0.012759103 hartree
energy: -958.878383080158
dipole: 33.40380 -32.34275 1.06105 -3.22395 4.62925 1.40530 4.23467 -5.38420 -1.14954
magnitude: 2.10288 au
magnitude: 5.34511 debye
