program: Orca
programVersion: 4.2.1
elementType: S O N C C C C C C C C C C C H H H H H H H H H H H H H H H H H H H
charge: 0
multiplicity: 1
keywords: wb97x-d3
keywords: def2-TZVPP
keywords: def2/J RIJCOSX GRIDX6 NOFINALGRIDX
keywords: grid4 nofinalgrid
keywords: scfconv7
keywords: smallprint printgap noloewdin
keywords: NOSOSCF
formula: C11H19NOS
InChI: InChI=1/C11H19NOS/c1-2-3-4-5-6-7-9-12-11(13)8-10-14-12/h8,10H,2-7,9H2,1H3
33 atoms
S  -2.815849 -0.218071 0.97014
O  -1.142018 0.938486 -2.199571
N  -2.035186 -0.351315 -0.526658
C  0.992293 -0.489235 0.809735
C  0.831691 -1.508936 -0.315901
C  2.245909 0.372895 0.688524
C  -0.479403 -2.29871 -0.282211
C  3.555689 -0.401534 0.797856
C  -1.643811 -1.657193 -1.025261
C  4.794781 0.487193 0.866079
C  5.046031 1.2983 -0.397298
C  -1.718659 0.845405 -1.123263
C  -2.187254 1.925698 -0.266023
C  -2.771814 1.491558 0.860858
H  1.004292 -1.017326 1.769804
H  0.125724 0.174511 0.848954
H  1.658967 -2.220927 -0.263604
H  0.932102 -1.007976 -1.284486
H  2.222734 1.134263 1.475575
H  2.207965 0.919493 -0.259371
H  -0.763574 -2.513934 0.753243
H  -0.331717 -3.274003 -0.752756
H  3.660068 -1.090609 -0.046537
H  3.519832 -1.028259 1.695523
H  -2.514456 -2.315923 -1.000391
H  -1.387304 -1.518996 -2.075273
H  4.708791 1.163081 1.723084
H  5.66888 -0.139484 1.064443
H  5.971381 1.871787 -0.320318
H  5.135561 0.650298 -1.272251
H  4.244033 2.0104 -0.598033
H  -2.059587 2.964604 -0.530434
H  -3.201113 2.084962 1.655394
elementType: S O N C H
totalener: -958.86113406 hartree
nucrepener: 1032.59104767 hartree
electener: -1991.45218173 hartree
oneelecener: -3359.89145536 hartree
twoeener: 1368.43927362 hartree
cpcmener: -0.01993030 hartree
kineticenergy: 955.50745457 hartree
xcener: -75.344857319916 hartree
chargesum: 0.0000000
charge: 0.112314 -0.539694 -0.072208 -0.131454 -0.116929 -0.132818 -0.141325 -0.109675 -0.091862 -0.119012 -0.275709 0.295280 -0.262326 -0.056665 0.072126 0.047184 0.087966 0.070768 0.072762 0.063590 0.072655 0.089862 0.061099 0.069538 0.128399 0.101397 0.054639 0.068630 0.091072 0.079849 0.080301 0.158206 0.172039
qa: 0.1123 -0.5397 -0.0722 -0.1315 -0.1169 -0.1328 -0.1413 -0.1097 -0.0919 -0.1190 -0.2757 0.2953 -0.2623 -0.0567 0.0721 0.0472 0.0880 0.0708 0.0728 0.0636 0.0727 0.0899 0.0611 0.0695 0.1284 0.1014 0.0546 0.0686 0.0911 0.0798 0.0803 0.1582 0.1720
va: 2.5518 1.9714 3.0688 3.9090 3.8011 3.9057 3.8760 3.8717 3.8438 3.9081 3.9250 4.2143 3.9119 3.9815 1.0125 1.0232 1.0073 1.0209 1.0085 1.0101 1.0098 1.0151 1.0077 1.0097 1.0022 1.0273 1.0084 1.0065 1.0043 1.0003 0.9993 1.0008 0.9859
dispcorr: -0.014345741 hartree
energy: -958.875479803623
dipole: 29.11238 -29.89558 -0.78320 -3.00003 2.37175 -0.62827 2.48449 -0.65364 1.83086
magnitude: 2.08810 au
magnitude: 5.30753 debye
