program: Orca
programVersion: 4.2.1
elementType: S O N C C C C C C C C C C C H H H H H H H H H H H H H H H H H H H
charge: 0
multiplicity: 1
keywords: wb97x-d3
keywords: def2-TZVPP
keywords: def2/J RIJCOSX GRIDX6 NOFINALGRIDX
keywords: grid4 nofinalgrid
keywords: scfconv7
keywords: smallprint printgap noloewdin
keywords: NOSOSCF
formula: C11H19NOS
InChI: InChI=1/C11H19NOS/c1-2-3-4-5-6-7-9-12-11(13)8-10-14-12/h8,10H,2-7,9H2,1H3
33 atoms
S  -2.731748 -0.054002 1.050704
O  -1.359516 0.555173 -2.404405
N  -2.029252 -0.430562 -0.44482
C  1.087486 0.004471 0.611135
C  0.946106 -1.207647 -0.307663
C  2.088182 1.044218 0.112387
C  -0.239063 -2.119669 0.023748
C  3.518724 0.549022 -0.088022
C  -1.536364 -1.772661 -0.696569
C  4.18976 0.032896 1.179576
C  5.650933 -0.331791 0.959656
C  -1.861829 0.639152 -1.290736
C  -2.379556 1.831959 -0.634252
C  -2.856387 1.593968 0.596785
H  1.362384 -0.339333 1.613549
H  0.123699 0.504301 0.733956
H  1.863625 -1.798719 -0.25035
H  0.871769 -0.878357 -1.348862
H  2.10171 1.88354 0.81537
H  1.720222 1.452093 -0.834756
H  -0.403891 -2.148315 1.10571
H  -0.007702 -3.147777 -0.265531
H  4.113746 1.376219 -0.488872
H  3.545213 -0.230597 -0.856098
H  -2.317952 -2.48667 -0.429076
H  -1.39845 -1.850816 -1.774687
H  4.118372 0.794501 1.962907
H  3.654945 -0.842502 1.55939
H  6.229582 0.531201 0.623489
H  6.115858 -0.700292 1.87556
H  5.757652 -1.111554 0.202534
H  -2.366351 2.800641 -1.11045
H  -3.294445 2.302384 1.28476
elementType: S O N C H
totalener: -958.86105792 hartree
nucrepener: 1037.22339888 hartree
electener: -1996.08445680 hartree
oneelecener: -3369.10998913 hartree
twoeener: 1373.02553232 hartree
cpcmener: -0.01985356 hartree
kineticenergy: 955.50366904 hartree
xcener: -75.344430889027 hartree
chargesum: 0.0000000
charge: 0.111490 -0.540190 -0.071123 -0.135974 -0.122231 -0.159973 -0.136093 -0.132676 -0.093353 -0.081898 -0.283512 0.298003 -0.267174 -0.053222 0.083874 0.054084 0.085835 0.072854 0.074261 0.073078 0.074429 0.088614 0.075049 0.066432 0.125803 0.102234 0.059364 0.054285 0.078452 0.090246 0.078758 0.158405 0.171871
qa: 0.1115 -0.5402 -0.0711 -0.1360 -0.1222 -0.1600 -0.1361 -0.1327 -0.0934 -0.0819 -0.2835 0.2980 -0.2672 -0.0532 0.0839 0.0541 0.0858 0.0729 0.0743 0.0731 0.0744 0.0886 0.0750 0.0664 0.1258 0.1022 0.0594 0.0543 0.0785 0.0902 0.0788 0.1584 0.1719
va: 2.5477 1.9682 3.0703 3.8628 3.7899 3.9259 3.8731 3.8740 3.8484 3.8500 3.9484 4.2102 3.9155 3.9742 1.0048 1.0225 1.0050 1.0261 1.0070 1.0121 1.0097 1.0156 1.0095 1.0021 1.0032 1.0251 1.0071 1.0056 1.0015 1.0034 1.0004 1.0006 0.9856
dispcorr: -0.014758130 hartree
energy: -958.875816051008
dipole: 30.06613 -30.71620 -0.65007 -3.67295 3.40192 -0.27103 4.15725 -2.20800 1.94925
magnitude: 2.07259 au
magnitude: 5.26810 debye
