program: Orca
programVersion: 4.2.1
elementType: S O N C C C C C C C C C C C H H H H H H H H H H H H H H H H H H H
charge: 0
multiplicity: 1
keywords: wb97x-d3
keywords: def2-TZVPP
keywords: def2/J RIJCOSX GRIDX6 NOFINALGRIDX
keywords: grid4 nofinalgrid
keywords: scfconv7
keywords: smallprint printgap noloewdin
keywords: NOSOSCF
formula: C11H19NOS
InChI: InChI=1/C11H19NOS/c1-2-3-4-5-6-7-9-12-11(13)8-10-14-12/h8,10H,2-7,9H2,1H3
33 atoms
S  -2.88192 0.112157 -0.964606
O  -0.648622 0.63519 2.022716
N  -1.883394 -0.310058 0.337791
C  1.666793 -1.823442 0.3639
C  0.652967 -1.585946 -0.750974
C  2.956315 -1.023942 0.185285
C  -0.680058 -2.295026 -0.540253
C  2.816733 0.448348 0.559953
C  -1.541965 -1.702131 0.567607
C  4.0752 1.275986 0.31285
C  4.393704 1.491939 -1.159752
C  -1.391654 0.752487 1.057543
C  -1.915984 1.982683 0.479378
C  -2.704207 1.774366 -0.584911
H  1.901635 -2.892088 0.393624
H  1.230258 -1.581002 1.337772
H  1.086007 -1.933999 -1.693402
H  0.479056 -0.514084 -0.888584
H  3.296559 -1.126679 -0.850506
H  3.745175 -1.464351 0.803117
H  -0.510734 -3.34717 -0.292865
H  -1.246888 -2.300048 -1.476218
H  2.549553 0.50932 1.618997
H  1.98004 0.900806 0.018386
H  -1.02879 -1.7360 1.527229
H  -2.460789 -2.28058 0.683837
H  3.958678 2.251063 0.7931
H  4.928464 0.799997 0.806087
H  5.273582 2.125301 -1.284967
H  4.595421 0.556347 -1.682526
H  3.56429 1.981449 -1.673791
H  -1.677823 2.954347 0.884273
H  -3.213209 2.512334 -1.18776
elementType: S O N C H
totalener: -958.86236349 hartree
nucrepener: 1038.76757692 hartree
electener: -1997.62994041 hartree
oneelecener: -3372.43222228 hartree
twoeener: 1374.80228187 hartree
cpcmener: -0.01889620 hartree
kineticenergy: 955.51877984 hartree
xcener: -75.346733341007 hartree
chargesum: 0.0000000
charge: 0.112540 -0.532915 -0.067379 -0.112547 -0.116654 -0.152516 -0.146791 -0.092406 -0.100108 -0.112523 -0.270752 0.292416 -0.261555 -0.065323 0.075132 0.061174 0.083299 0.059078 0.059775 0.075750 0.077079 0.086468 0.067025 0.047320 0.104892 0.133099 0.069752 0.050954 0.090912 0.076169 0.077372 0.158648 0.172612
qa: 0.1125 -0.5329 -0.0674 -0.1125 -0.1167 -0.1525 -0.1468 -0.0924 -0.1001 -0.1125 -0.2708 0.2924 -0.2616 -0.0653 0.0751 0.0612 0.0833 0.0591 0.0598 0.0757 0.0771 0.0865 0.0670 0.0473 0.1049 0.1331 0.0698 0.0510 0.0909 0.0762 0.0774 0.1586 0.1726
va: 2.5562 1.9803 3.0654 3.8732 3.8355 3.9215 3.9111 3.8703 3.8145 3.9013 3.9253 4.2137 3.9194 3.9943 1.0097 1.0224 1.0119 1.0145 1.0067 1.0092 1.0196 1.0077 1.0173 1.0124 1.0218 1.0026 1.0051 1.0089 1.0042 1.0004 1.0018 0.9991 0.9858
dispcorr: -0.014458426 hartree
energy: -958.876821912336
dipole: 26.79250 -27.92131 -1.12881 -3.99060 3.73583 -0.25478 -2.79573 1.14907 -1.64666
magnitude: 2.01262 au
magnitude: 5.11567 debye
