program: Orca
programVersion: 4.2.1
elementType: S O N C C C C C C C C C C C H H H H H H H H H H H H H H H H H H H
charge: 0
multiplicity: 1
keywords: wb97x-d3
keywords: def2-TZVPP
keywords: def2/J RIJCOSX GRIDX6 NOFINALGRIDX
keywords: grid4 nofinalgrid
keywords: scfconv7
keywords: smallprint printgap noloewdin
keywords: NOSOSCF
formula: C11H19NOS
InChI: InChI=1/C11H19NOS/c1-2-3-4-5-6-7-9-12-11(13)8-10-14-12/h8,10H,2-7,9H2,1H3
33 atoms
S  -2.624506 0.20622 1.187801
O  -2.626368 0.365169 -2.570304
N  -2.263839 -0.254099 -0.400537
C  2.22989 -0.237677 -0.105694
C  0.754614 -0.473974 0.195408
C  2.981136 0.371784 1.07224
C  0.009329 -1.1048 -0.972831
C  4.422403 0.767269 0.760699
C  -1.450081 -1.425263 -0.686913
C  5.328806 -0.369476 0.293361
C  5.445135 -1.515709 1.287232
C  -2.793574 0.556809 -1.371272
C  -3.554582 1.616365 -0.726209
C  -3.539728 1.534977 0.613655
H  2.320541 0.422005 -0.976116
H  2.692859 -1.186574 -0.395623
H  0.291551 0.480911 0.463207
H  0.662787 -1.117921 1.077527
H  2.956322 -0.323596 1.917736
H  2.445639 1.264853 1.410668
H  0.49189 -2.047356 -1.248835
H  0.072876 -0.459519 -1.853182
H  4.861369 1.223956 1.653918
H  4.416516 1.550711 -0.004109
H  -1.532227 -2.111246 0.158184
H  -1.899887 -1.932631 -1.541007
H  4.98176 -0.755704 -0.66951
H  6.32453 0.040963 0.103005
H  6.175033 -2.25468 0.952366
H  5.766599 -1.160897 2.269169
H  4.497918 -2.040568 1.423529
H  -4.072151 2.378876 -1.288403
H  -4.021218 2.193373 1.322278
elementType: S O N C H
totalener: -958.86444543 hartree
nucrepener: 993.48805925 hartree
electener: -1952.35250468 hartree
oneelecener: -3281.37293698 hartree
twoeener: 1329.02043229 hartree
cpcmener: -0.02080271 hartree
kineticenergy: 955.50982467 hartree
xcener: -75.344568274435 hartree
chargesum: 0.0000000
charge: 0.117163 -0.552428 -0.071593 -0.135662 -0.128885 -0.124305 -0.076745 -0.154509 -0.113322 -0.115564 -0.275681 0.326362 -0.275858 -0.062926 0.067510 0.061546 0.058553 0.070649 0.068005 0.074334 0.077206 0.072475 0.075643 0.070038 0.119703 0.112034 0.060473 0.072393 0.093250 0.082318 0.076688 0.158510 0.172626
qa: 0.1172 -0.5524 -0.0716 -0.1357 -0.1289 -0.1243 -0.0767 -0.1545 -0.1133 -0.1156 -0.2757 0.3264 -0.2759 -0.0629 0.0675 0.0615 0.0586 0.0706 0.0680 0.0743 0.0772 0.0725 0.0756 0.0700 0.1197 0.1120 0.0605 0.0724 0.0933 0.0823 0.0767 0.1585 0.1726
va: 2.5575 1.9595 3.0703 3.9074 3.8784 3.8578 3.7710 3.9014 3.8793 3.8726 3.9284 4.1972 3.9262 3.9818 1.0095 1.0086 1.0140 1.0055 1.0018 1.0117 1.0170 1.0255 1.0069 1.0095 1.0011 1.0200 1.0025 1.0076 1.0050 1.0010 0.9975 0.9994 0.9855
dispcorr: -0.012877217 hartree
energy: -958.877322646791
dipole: 35.31269 -35.22238 0.09031 -5.44733 5.44391 -0.00342 4.36480 -2.28587 2.07893
magnitude: 2.08090 au
magnitude: 5.28921 debye
