program: Orca
programVersion: 4.2.1
elementType: S O N C C C C C C C C C C C H H H H H H H H H H H H H H H H H H H
charge: 0
multiplicity: 1
keywords: wb97x-d3
keywords: def2-TZVPP
keywords: def2/J RIJCOSX GRIDX6 NOFINALGRIDX
keywords: grid4 nofinalgrid
keywords: scfconv7
keywords: smallprint printgap noloewdin
keywords: NOSOSCF
formula: C11H19NOS
InChI: InChI=1/C11H19NOS/c1-2-3-4-5-6-7-9-12-11(13)8-10-14-12/h8,10H,2-7,9H2,1H3
33 atoms
S  -2.897889 0.546355 1.074404
O  -2.477772 -0.205192 -2.588006
N  -2.202844 0.608255 -0.469243
C  1.843303 -0.942165 0.753709
C  0.599156 -0.058694 0.710646
C  3.149547 -0.224933 0.431537
C  0.282012 0.497976 -0.671783
C  4.364928 -1.131181 0.597296
C  -0.97795 1.350596 -0.72586
C  5.690327 -0.492917 0.191284
C  6.093676 0.700965 1.044558
C  -2.85106 -0.134102 -1.422588
C  -4.004251 -0.774884 -0.808575
C  -4.13025 -0.492545 0.497759
H  1.710743 -1.784421 0.06576
H  1.919962 -1.381184 1.753655
H  0.71641 0.770742 1.417504
H  -0.247618 -0.648802 1.072458
H  3.243675 0.652379 1.08005
H  3.128642 0.155537 -0.595144
H  0.196878 -0.317227 -1.39615
H  1.101926 1.131882 -1.020021
H  4.21356 -2.037258 0.00126
H  4.428847 -1.464343 1.639537
H  -1.080514 1.808272 -1.710142
H  -0.918343 2.171101 -0.00813
H  6.477077 -1.250688 0.247336
H  5.639945 -0.190242 -0.859685
H  5.393111 1.532006 0.949568
H  6.144296 0.433306 2.102485
H  7.07692 1.076464 0.756123
H  -4.675869 -1.410013 -1.365844
H  -4.893196 -0.84074 1.17869
elementType: S O N C H
totalener: -958.86414736 hartree
nucrepener: 986.38650278 hartree
electener: -1945.25065014 hartree
oneelecener: -3267.17954834 hartree
twoeener: 1321.92889820 hartree
cpcmener: -0.02074166 hartree
kineticenergy: 955.50748472 hartree
xcener: -75.343773956820 hartree
chargesum: 0.0000000
charge: 0.116484 -0.553211 -0.073897 -0.141252 -0.140257 -0.123085 -0.087490 -0.121449 -0.109641 -0.107685 -0.277458 0.326666 -0.276006 -0.061461 0.067165 0.072509 0.072349 0.072882 0.063589 0.062609 0.074004 0.078434 0.067602 0.063081 0.111551 0.119415 0.068837 0.054055 0.078962 0.080107 0.091881 0.158128 0.172584
qa: 0.1165 -0.5532 -0.0739 -0.1413 -0.1403 -0.1231 -0.0875 -0.1214 -0.1096 -0.1077 -0.2775 0.3267 -0.2760 -0.0615 0.0672 0.0725 0.0723 0.0729 0.0636 0.0626 0.0740 0.0784 0.0676 0.0631 0.1116 0.1194 0.0688 0.0541 0.0790 0.0801 0.0919 0.1581 0.1726
va: 2.5562 1.9576 3.0740 3.9356 3.8866 3.8604 3.7757 3.8875 3.8768 3.8961 3.9268 4.1993 3.9259 3.9768 1.0096 1.0086 1.0064 1.0188 1.0052 1.0064 1.0227 1.0173 1.0106 1.0088 1.0200 1.0007 1.0073 1.0089 0.9986 1.0001 1.0045 0.9996 0.9853
dispcorr: -0.012598909 hartree
energy: -958.876746267988
dipole: 37.38917 -37.54932 -0.16016 -1.56918 1.85491 0.28574 4.99251 -2.93376 2.05875
magnitude: 2.08464 au
magnitude: 5.29874 debye
