program: Orca
programVersion: 4.2.1
elementType: S O N C C C C C C C C C C C H H H H H H H H H H H H H H H H H H H
charge: 0
multiplicity: 1
keywords: wb97x-d3
keywords: def2-TZVPP
keywords: def2/J RIJCOSX GRIDX6 NOFINALGRIDX
keywords: grid4 nofinalgrid
keywords: scfconv7
keywords: smallprint printgap noloewdin
keywords: NOSOSCF
formula: C11H19NOS
InChI: InChI=1/C11H19NOS/c1-2-3-4-5-6-7-9-12-11(13)8-10-14-12/h8,10H,2-7,9H2,1H3
33 atoms
S  -2.792634 -0.622914 -1.47587
O  -2.458884 1.56544 1.563662
N  -2.330736 -0.175192 0.088407
C  2.080956 -0.485631 -0.422968
C  0.632619 -0.963647 -0.391114
C  3.001179 -1.187827 0.56983
C  -0.059297 -0.733585 0.946331
C  4.474202 -0.823144 0.40684
C  -1.546784 -1.057323 0.938999
C  4.791315 0.645059 0.668885
C  6.277107 0.95259 0.561988
C  -2.71529 1.086919 0.464948
C  -3.447395 1.696578 -0.634291
C  -3.55149 0.895517 -1.706155
H  2.095165 0.594622 -0.248192
H  2.474635 -0.631632 -1.434402
H  0.589059 -2.028815 -0.64376
H  0.08873 -0.44122 -1.182978
H  2.889226 -2.27116 0.452735
H  2.690808 -0.962664 1.595451
H  0.081406 0.301351 1.270946
H  0.394874 -1.359157 1.719149
H  4.804012 -1.089821 -0.603868
H  5.069124 -1.439376 1.088937
H  -1.954605 -0.983104 1.947585
H  -1.715376 -2.085511 0.613286
H  4.245027 1.279008 -0.034911
H  4.430535 0.920106 1.665611
H  6.659735 0.71924 -0.433959
H  6.483303 2.007257 0.751637
H  6.858619 0.370748 1.28032
H  -3.855824 2.693896 -0.570575
H  -4.039231 1.107115 -2.646578
elementType: S O N C H
totalener: -958.86393479 hartree
nucrepener: 991.14899240 hartree
electener: -1950.01292719 hartree
oneelecener: -3276.77025893 hartree
twoeener: 1326.75733174 hartree
cpcmener: -0.02060193 hartree
kineticenergy: 955.51745368 hartree
xcener: -75.345932262949 hartree
chargesum: -0.0000000
charge: 0.115776 -0.552250 -0.072342 -0.137113 -0.150487 -0.117442 -0.084435 -0.145034 -0.113381 -0.076009 -0.285740 0.326257 -0.275976 -0.061321 0.065934 0.075944 0.073441 0.072744 0.072596 0.063212 0.074561 0.078686 0.060006 0.069907 0.113292 0.116356 0.057956 0.057312 0.077497 0.090119 0.078830 0.158669 0.172434
qa: 0.1158 -0.5522 -0.0723 -0.1371 -0.1505 -0.1174 -0.0844 -0.1450 -0.1134 -0.0760 -0.2857 0.3263 -0.2760 -0.0613 0.0659 0.0759 0.0734 0.0727 0.0726 0.0632 0.0746 0.0787 0.0600 0.0699 0.1133 0.1164 0.0580 0.0573 0.0775 0.0901 0.0788 0.1587 0.1724
va: 2.5571 1.9591 3.0716 3.9124 3.8922 3.8874 3.7676 3.9075 3.8888 3.8487 3.9499 4.1970 3.9264 3.9779 1.0078 1.0080 1.0072 1.0193 1.0097 1.0079 1.0243 1.0165 1.0082 1.0091 1.0181 1.0006 1.0077 1.0061 1.0005 1.0036 1.0010 0.9995 0.9854
dispcorr: -0.012697690 hartree
energy: -958.876632477937
dipole: 36.25165 -36.36833 -0.11668 -3.02168 1.87221 -1.14947 4.33440 -6.07074 -1.73635
magnitude: 2.08562 au
magnitude: 5.30122 debye
