program: Orca
programVersion: 4.2.1
elementType: S O N C C C C C C C C C C C H H H H H H H H H H H H H H H H H H H
charge: 0
multiplicity: 1
keywords: wb97x-d3
keywords: def2-TZVPP
keywords: def2/J RIJCOSX GRIDX6 NOFINALGRIDX
keywords: grid4 nofinalgrid
keywords: scfconv7
keywords: smallprint printgap noloewdin
keywords: NOSOSCF
formula: C11H19NOS
InChI: InChI=1/C11H19NOS/c1-2-3-4-5-6-7-9-12-11(13)8-10-14-12/h8,10H,2-7,9H2,1H3
33 atoms
S  -3.421363 -0.668238 0.562732
O  -2.324918 1.853122 -2.010698
N  -2.405951 0.067931 -0.577442
C  2.236983 -0.296088 1.279869
C  1.298249 -0.581019 0.112583
C  3.658877 -0.821503 1.093821
C  -0.119162 -0.08701 0.374845
C  4.439139 -0.13458 -0.022073
C  -1.055169 -0.422907 -0.777504
C  5.863946 -0.655003 -0.200327
C  6.781646 -0.392391 0.985928
C  -2.930573 1.182595 -1.183941
C  -4.27888 1.393499 -0.675829
C  -4.643799 0.490573 0.246626
H  1.81369 -0.743436 2.184739
H  2.271222 0.782978 1.465295
H  1.279638 -1.659374 -0.079782
H  1.674858 -0.113277 -0.80175
H  3.62575 -1.900241 0.903336
H  4.192498 -0.699437 2.040333
H  -0.114408 0.99555 0.530222
H  -0.496258 -0.53587 1.299563
H  4.469584 0.944008 0.169925
H  3.908764 -0.256864 -0.97042
H  -1.092314 -1.502134 -0.942469
H  -0.697331 0.025243 -1.704385
H  5.833692 -1.729319 -0.408328
H  6.296926 -0.189635 -1.090161
H  6.827804 0.672974 1.222542
H  6.45628 -0.915144 1.886444
H  7.799758 -0.723623 0.774581
H  -4.901321 2.206194 -1.018206
H  -5.583374 0.428291 0.775952
elementType: S O N C H
totalener: -958.86455826 hartree
nucrepener: 962.73382770 hartree
electener: -1921.59838596 hartree
oneelecener: -3219.82178847 hartree
twoeener: 1298.22340251 hartree
cpcmener: -0.02065044 hartree
kineticenergy: 955.50866071 hartree
xcener: -75.343131384724 hartree
chargesum: -0.0000000
charge: 0.114740 -0.550032 -0.074275 -0.135155 -0.134697 -0.134140 -0.088868 -0.113290 -0.080829 -0.116259 -0.275585 0.317125 -0.270581 -0.069587 0.074654 0.064979 0.064433 0.072441 0.061123 0.076197 0.077012 0.063453 0.061669 0.070025 0.123264 0.097073 0.055060 0.069192 0.079930 0.078384 0.090792 0.159817 0.171934
qa: 0.1147 -0.5500 -0.0743 -0.1352 -0.1347 -0.1341 -0.0889 -0.1133 -0.0808 -0.1163 -0.2756 0.3171 -0.2706 -0.0696 0.0747 0.0650 0.0644 0.0724 0.0611 0.0762 0.0770 0.0635 0.0617 0.0700 0.1233 0.0971 0.0551 0.0692 0.0799 0.0784 0.0908 0.1598 0.1719
va: 2.5528 1.9652 3.0877 3.9112 3.8951 3.8904 3.8553 3.8636 3.7986 3.8995 3.9281 4.2118 3.9144 3.9941 1.0086 1.0089 1.0108 1.0098 1.0087 1.0101 1.0164 1.0209 1.0083 1.0141 1.0015 1.0324 1.0078 1.0057 1.0002 0.9992 1.0045 0.9984 0.9864
dispcorr: -0.011753258 hartree
energy: -958.876311518609
dipole: 41.05149 -41.60061 -0.54912 -4.59013 3.24239 -1.34773 5.89508 -4.40174 1.49334
magnitude: 2.08518 au
magnitude: 5.30011 debye
