program: Orca
programVersion: 4.2.1
elementType: S O N C C C C C C C C C C C H H H H H H H H H H H H H H H H H H H
charge: 0
multiplicity: 1
keywords: wb97x-d3
keywords: def2-TZVPP
keywords: def2/J RIJCOSX GRIDX6 NOFINALGRIDX
keywords: grid4 nofinalgrid
keywords: scfconv7
keywords: smallprint printgap noloewdin
keywords: NOSOSCF
formula: C11H19NOS
InChI: InChI=1/C11H19NOS/c1-2-3-4-5-6-7-9-12-11(13)8-10-14-12/h8,10H,2-7,9H2,1H3
33 atoms
S  -1.739782 0.465023 1.126779
O  -2.32019 -0.131715 -2.54113
N  -2.033085 -0.410158 -0.29152
C  1.220339 -0.826897 -0.352007
C  0.503643 -2.084582 0.134312
C  2.257615 -0.307895 0.63428
C  -0.704663 -2.494592 -0.710233
C  2.971596 0.940307 0.127655
C  -2.027877 -1.863718 -0.292476
C  3.871215 1.61853 1.156483
C  5.021254 0.751945 1.648977
C  -2.125887 0.349005 -1.430831
C  -1.956343 1.748589 -1.069854
C  -1.740654 1.932028 0.242723
H  0.506005 -0.024858 -0.555351
H  1.699469 -1.043093 -1.313193
H  0.197684 -1.960551 1.179623
H  1.22496 -2.906392 0.141457
H  2.983323 -1.098335 0.85193
H  1.760817 -0.080408 1.584631
H  -0.856582 -3.574652 -0.638332
H  -0.515287 -2.28818 -1.766929
H  2.219694 1.662387 -0.20833
H  3.56164 0.686465 -0.760072
H  -2.301319 -2.198898 0.709435
H  -2.827876 -2.193987 -0.956028
H  4.277677 2.534258 0.717781
H  3.265352 1.938788 2.010311
H  5.640776 0.404002 0.819179
H  5.669235 1.307245 2.329365
H  4.670143 -0.129057 2.188327
H  -1.998697 2.541411 -1.801463
H  -1.585814 2.865272 0.764811
elementType: S O N C H
totalener: -958.86188053 hartree
nucrepener: 1043.31462874 hartree
electener: -2002.17650927 hartree
oneelecener: -3381.01956734 hartree
twoeener: 1378.84305806 hartree
cpcmener: -0.02091440 hartree
kineticenergy: 955.50859106 hartree
xcener: -75.345160290749 hartree
chargesum: -0.0000000
charge: 0.114099 -0.544109 -0.061167 -0.128297 -0.155873 -0.112992 -0.105716 -0.112081 -0.104038 -0.113556 -0.276612 0.309279 -0.268486 -0.055511 0.032573 0.080620 0.070483 0.088477 0.070109 0.051566 0.087975 0.076069 0.064752 0.065608 0.115188 0.107586 0.069580 0.053750 0.080556 0.091419 0.079095 0.156894 0.172761
qa: 0.1141 -0.5441 -0.0612 -0.1283 -0.1559 -0.1130 -0.1057 -0.1121 -0.1040 -0.1136 -0.2766 0.3093 -0.2685 -0.0555 0.0326 0.0806 0.0705 0.0885 0.0701 0.0516 0.0880 0.0761 0.0648 0.0656 0.1152 0.1076 0.0696 0.0537 0.0806 0.0914 0.0791 0.1569 0.1728
va: 2.5564 1.9705 3.0561 3.8766 3.8680 3.8587 3.8117 3.8728 3.8998 3.8994 3.9284 4.1973 3.9098 3.9683 1.0263 1.0152 1.0055 1.0111 1.0092 1.0143 1.0133 1.0235 1.0114 1.0087 1.0006 1.0175 1.0076 1.0079 1.0001 1.0048 0.9985 1.0011 0.9851
dispcorr: -0.014624526 hartree
energy: -958.876505057411
dipole: 26.39140 -25.90154 0.48986 -3.40796 3.76159 0.35363 5.08204 -3.06421 2.01784
magnitude: 2.10634 au
magnitude: 5.35390 debye
