program: Orca
programVersion: 4.2.1
elementType: S O N C C C C C C C C C C C H H H H H H H H H H H H H H H H H H H
charge: 0
multiplicity: 1
keywords: wb97x-d3
keywords: def2-TZVPP
keywords: def2/J RIJCOSX GRIDX6 NOFINALGRIDX
keywords: grid4 nofinalgrid
keywords: scfconv7
keywords: smallprint printgap noloewdin
keywords: NOSOSCF
formula: C11H19NOS
InChI: InChI=1/C11H19NOS/c1-2-3-4-5-6-7-9-12-11(13)8-10-14-12/h8,10H,2-7,9H2,1H3
33 atoms
S  -3.207836 0.045575 1.037147
O  -2.36195 0.814433 -2.550162
N  -2.41936 -0.106818 -0.454426
C  2.406132 -1.185131 0.541323
C  1.114052 -1.531842 -0.193251
C  3.045429 0.129186 0.105027
C  -0.017811 -0.533411 0.018658
C  4.34273 0.465982 0.836496
C  -1.3132 -1.03287 -0.606609
C  5.491165 -0.503728 0.581411
C  6.77879 -0.0778 1.271375
C  -2.844387 0.766423 -1.425272
C  -3.926704 1.572923 -0.879308
C  -4.201362 1.290546 0.403062
H  3.11153 -2.006281 0.387117
H  2.211988 -1.153336 1.619485
H  0.78102 -2.520386 0.139208
H  1.318146 -1.627371 -1.264988
H  2.34009 0.949785 0.265189
H  3.233571 0.100831 -0.974514
H  0.232492 0.436318 -0.418192
H  -0.164483 -0.368095 1.09153
H  4.147795 0.521874 1.913546
H  4.661011 1.470396 0.538465
H  -1.601203 -1.996758 -0.180787
H  -1.183844 -1.190546 -1.677618
H  5.221313 -1.507527 0.920397
H  5.663383 -0.584166 -0.496909
H  7.107038 0.907143 0.932322
H  6.650248 -0.024053 2.354662
H  7.591264 -0.779019 1.073927
H  -4.436739 2.322453 -1.465454
H  -4.949672 1.745549 1.035759
elementType: S O N C H
totalener: -958.86465482 hartree
nucrepener: 969.14144063 hartree
electener: -1928.00609544 hartree
oneelecener: -3232.65687770 hartree
twoeener: 1304.65078226 hartree
cpcmener: -0.02068679 hartree
kineticenergy: 955.50533748 hartree
xcener: -75.342452298556 hartree
chargesum: -0.0000000
charge: 0.115250 -0.551060 -0.076156 -0.128018 -0.160647 -0.121063 -0.079343 -0.141207 -0.091903 -0.076891 -0.285366 0.321719 -0.273091 -0.069171 0.076885 0.065224 0.075501 0.075192 0.075557 0.063677 0.076075 0.065560 0.059496 0.069844 0.123317 0.098628 0.056054 0.056958 0.078460 0.078060 0.090484 0.159670 0.172304
qa: 0.1153 -0.5511 -0.0762 -0.1280 -0.1606 -0.1211 -0.0793 -0.1412 -0.0919 -0.0769 -0.2854 0.3217 -0.2731 -0.0692 0.0769 0.0652 0.0755 0.0752 0.0756 0.0637 0.0761 0.0656 0.0595 0.0698 0.1233 0.0986 0.0561 0.0570 0.0785 0.0781 0.0905 0.1597 0.1723
va: 2.5528 1.9628 3.0906 3.8877 3.9245 3.8825 3.8157 3.9038 3.8104 3.8536 3.9498 4.2071 3.9193 3.9932 1.0117 1.0072 1.0109 1.0080 1.0114 1.0087 1.0176 1.0188 1.0076 1.0084 1.0029 1.0285 1.0075 1.0061 1.0013 1.0002 1.0034 0.9983 0.9860
dispcorr: -0.011863973 hartree
energy: -958.876518789030
dipole: 39.52328 -39.92547 -0.40219 -4.96233 4.59345 -0.36888 5.38418 -3.37203 2.01215
magnitude: 2.08484 au
magnitude: 5.29925 debye
