program: Orca
programVersion: 4.2.1
elementType: S O N C C C C C C C C C C C H H H H H H H H H H H H H H H H H H H
charge: 0
multiplicity: 1
keywords: wb97x-d3
keywords: def2-TZVPP
keywords: def2/J RIJCOSX GRIDX6 NOFINALGRIDX
keywords: grid4 nofinalgrid
keywords: scfconv7
keywords: smallprint printgap noloewdin
keywords: NOSOSCF
formula: C11H19NOS
InChI: InChI=1/C11H19NOS/c1-2-3-4-5-6-7-9-12-11(13)8-10-14-12/h8,10H,2-7,9H2,1H3
33 atoms
S  -2.477108 0.440764 -1.725238
O  -2.763304 -0.047017 1.993083
N  -2.309619 -0.331384 -0.228583
C  2.184614 -0.903948 -0.402451
C  0.694375 -0.852826 -0.731355
C  2.574995 -0.127398 0.850834
C  -0.193488 -1.536718 0.30078
C  4.070615 -0.147526 1.158019
C  -1.656813 -1.625624 -0.10675
C  4.943191 0.550584 0.120637
C  6.412502 0.57655 0.513973
C  -2.809491 0.367194 0.840474
C  -3.378327 1.615243 0.354507
C  -3.263306 1.764237 -0.974514
H  2.733624 -0.511929 -1.262819
H  2.498076 -1.948615 -0.295216
H  0.535412 -1.32841 -1.704932
H  0.394908 0.193276 -0.851356
H  2.041318 -0.53303 1.71504
H  2.240137 0.911621 0.751308
H  -0.125692 -1.037298 1.269762
H  0.155945 -2.561877 0.459218
H  4.404041 -1.185206 1.273587
H  4.234372 0.328612 2.130329
H  -2.219579 -2.204483 0.626315
H  -1.758511 -2.149555 -1.059102
H  4.843253 0.058249 -0.850457
H  4.584786 1.575484 -0.02111
H  7.020473 1.081684 -0.23836
H  6.562932 1.098992 1.461098
H  6.810813 -0.433517 0.631208
H  -3.841163 2.333004 1.014625
H  -3.598595 2.594446 -1.579123
elementType: S O N C H
totalener: -958.86389778 hartree
nucrepener: 994.02492532 hartree
electener: -1952.88882309 hartree
oneelecener: -3282.53785020 hartree
twoeener: 1329.64902710 hartree
cpcmener: -0.02080391 hartree
kineticenergy: 955.51242256 hartree
xcener: -75.344763616946 hartree
chargesum: 0.0000000
charge: 0.117852 -0.553183 -0.070829 -0.138223 -0.152288 -0.118884 -0.079588 -0.142413 -0.115574 -0.076284 -0.285554 0.328809 -0.276209 -0.063423 0.076644 0.065761 0.084675 0.060629 0.075190 0.063411 0.069652 0.078772 0.059887 0.069864 0.111867 0.119096 0.055539 0.056681 0.090364 0.078005 0.078518 0.158658 0.172580
qa: 0.1179 -0.5532 -0.0708 -0.1382 -0.1523 -0.1189 -0.0796 -0.1424 -0.1156 -0.0763 -0.2856 0.3288 -0.2762 -0.0634 0.0766 0.0658 0.0847 0.0606 0.0752 0.0634 0.0697 0.0788 0.0599 0.0699 0.1119 0.1191 0.0555 0.0567 0.0904 0.0780 0.0785 0.1587 0.1726
va: 2.5591 1.9575 3.0713 3.9242 3.9027 3.8809 3.7635 3.9059 3.8894 3.8517 3.9492 4.1928 3.9293 3.9812 1.0104 1.0090 1.0050 1.0118 1.0127 1.0086 1.0297 1.0162 1.0077 1.0086 1.0193 1.0016 1.0081 1.0061 1.0033 1.0015 1.0002 0.9994 0.9853
dispcorr: -0.012719565 hartree
energy: -958.876617341816
dipole: 35.47487 -35.24316 0.23171 -3.59934 3.93492 0.33558 3.33505 -5.40827 -2.07322
magnitude: 2.11295 au
magnitude: 5.37068 debye
