program: Orca
programVersion: 4.2.1
elementType: S O N C C C C C C C C C C C H H H H H H H H H H H H H H H H H H H
charge: 0
multiplicity: 1
keywords: wb97x-d3
keywords: def2-TZVPP
keywords: def2/J RIJCOSX GRIDX6 NOFINALGRIDX
keywords: grid4 nofinalgrid
keywords: scfconv7
keywords: smallprint printgap noloewdin
keywords: NOSOSCF
formula: C11H19NOS
InChI: InChI=1/C11H19NOS/c1-2-3-4-5-6-7-9-12-11(13)8-10-14-12/h8,10H,2-7,9H2,1H3
33 atoms
S  -1.915584 1.333332 -1.184277
O  -3.414187 -1.411402 0.914521
N  -2.220292 -0.248288 -0.660351
C  1.842527 -1.386311 0.790272
C  0.344671 -1.323671 0.504956
C  2.616331 -0.145116 0.35901
C  -0.00007 -1.313063 -0.97801
C  4.087217 -0.194337 0.751968
C  -1.496324 -1.359874 -1.251841
C  4.869469 1.041584 0.3259
C  6.336293 0.981577 0.723386
C  -3.093097 -0.349563 0.39543
C  -3.542425 0.988634 0.752525
C  -2.989829 1.950779 -0.001435
H  2.270063 -2.271186 0.305591
H  1.985331 -1.534592 1.865354
H  -0.071138 -0.434868 0.991144
H  -0.14578 -2.181949 0.97465
H  2.150328 0.741418 0.804442
H  2.542931 -0.011622 -0.725126
H  0.443579 -2.184845 -1.468127
H  0.437821 -0.440145 -1.471446
H  4.551138 -1.084772 0.312695
H  4.169238 -0.316937 1.837878
H  -1.932839 -2.265321 -0.830543
H  -1.691036 -1.382956 -2.326234
H  4.790724 1.165328 -0.758912
H  4.408811 1.932174 0.765223
H  6.452553 0.894718 1.805827
H  6.836772 0.12267 0.271175
H  6.875185 1.876599 0.408039
H  -4.245151 1.164177 1.552856
H  -3.153756 3.016764 0.060859
elementType: S O N C H
totalener: -958.86579425 hartree
nucrepener: 996.02377665 hartree
electener: -1954.88957090 hartree
oneelecener: -3286.44256413 hartree
twoeener: 1331.55299323 hartree
cpcmener: -0.02071942 hartree
kineticenergy: 955.51622357 hartree
xcener: -75.344725264594 hartree
chargesum: -0.0000000
charge: 0.114719 -0.546703 -0.077423 -0.133763 -0.116929 -0.099707 -0.124829 -0.118880 -0.097608 -0.074232 -0.282543 0.309043 -0.263565 -0.065019 0.063836 0.072800 0.061527 0.084254 0.055218 0.057927 0.081270 0.071349 0.056266 0.055990 0.104048 0.130057 0.053644 0.053895 0.077737 0.077679 0.089813 0.158345 0.171782
qa: 0.1147 -0.5467 -0.0774 -0.1338 -0.1169 -0.0997 -0.1248 -0.1189 -0.0976 -0.0742 -0.2825 0.3090 -0.2636 -0.0650 0.0638 0.0728 0.0615 0.0843 0.0552 0.0579 0.0813 0.0713 0.0563 0.0560 0.1040 0.1301 0.0536 0.0539 0.0777 0.0777 0.0898 0.1583 0.1718
va: 2.5591 1.9668 3.0625 3.9105 3.8559 3.8626 3.8477 3.8942 3.8275 3.8711 3.9481 4.2116 3.9146 3.9973 1.0089 1.0097 1.0163 1.0178 1.0110 1.0104 1.0200 1.0069 1.0077 1.0093 1.0281 1.0014 1.0069 1.0065 1.0005 1.0006 1.0044 0.9989 0.9860
dispcorr: -0.012673274 hartree
energy: -958.878467527854
dipole: 34.59830 -33.67247 0.92583 -3.07053 4.61889 1.54836 4.12260 -5.19075 -1.06815
magnitude: 2.09655 au
magnitude: 5.32901 debye
