program: Orca
programVersion: 4.2.1
elementType: S O N C C C C C C C C C C C H H H H H H H H H H H H H H H H H H H
charge: 0
multiplicity: 1
keywords: wb97x-d3
keywords: def2-TZVPP
keywords: def2/J RIJCOSX GRIDX6 NOFINALGRIDX
keywords: grid4 nofinalgrid
keywords: scfconv7
keywords: smallprint printgap noloewdin
keywords: NOSOSCF
formula: C11H19NOS
InChI: InChI=1/C11H19NOS/c1-2-3-4-5-6-7-9-12-11(13)8-10-14-12/h8,10H,2-7,9H2,1H3
33 atoms
S  -1.480308 0.806803 1.135643
O  -2.307889 -0.012871 -2.446076
N  -1.834437 -0.163134 -0.208051
C  2.051193 -2.193579 -0.662643
C  0.606414 -1.809462 -0.975611
C  2.678462 -1.452074 0.518291
C  -0.370471 -2.1350 0.14662
C  2.642322 0.066306 0.392655
C  -1.779192 -1.609735 -0.093416
C  3.34283 0.785654 1.538202
C  3.249186 2.299555 1.421319
C  -2.061863 0.526671 -1.374847
C  -1.95858 1.95251 -1.095756
C  -1.653254 2.221284 0.182216
H  2.658565 -2.012191 -1.554835
H  2.107562 -3.270972 -0.476275
H  0.28856 -2.329017 -1.884297
H  0.562064 -0.743653 -1.215712
H  3.718881 -1.778679 0.615337
H  2.192552 -1.748846 1.453443
H  -0.003742 -1.751759 1.103841
H  -0.442289 -3.219218 0.271657
H  1.604591 0.412635 0.351038
H  3.09874 0.365343 -0.558183
H  -2.446802 -1.927509 0.710067
H  -2.189339 -2.00736 -1.02128
H  2.902675 0.466858 2.488498
H  4.394186 0.483427 1.57477
H  3.747635 2.801262 2.252342
H  3.71042 2.65787 0.498514
H  2.208403 2.631397 1.415595
H  -2.110902 2.699111 -1.860565
H  -1.517877 3.189214 0.642925
elementType: S O N C H
totalener: -958.86398500 hartree
nucrepener: 1049.32248865 hartree
electener: -2008.18647365 hartree
oneelecener: -3392.99473892 hartree
twoeener: 1384.80826527 hartree
cpcmener: -0.02046314 hartree
kineticenergy: 955.50941377 hartree
xcener: -75.345950054875 hartree
chargesum: 0.0000000
charge: 0.106306 -0.543742 -0.067748 -0.159144 -0.121563 -0.129932 -0.140195 -0.093552 -0.085606 -0.087501 -0.269112 0.298429 -0.255849 -0.063051 0.077109 0.074417 0.088367 0.068176 0.075424 0.064184 0.073022 0.086408 0.024065 0.067899 0.130446 0.101144 0.053486 0.057922 0.090791 0.078032 0.069458 0.158912 0.172995
qa: 0.1063 -0.5437 -0.0677 -0.1591 -0.1216 -0.1299 -0.1402 -0.0936 -0.0856 -0.0875 -0.2691 0.2984 -0.2558 -0.0631 0.0771 0.0744 0.0884 0.0682 0.0754 0.0642 0.0730 0.0864 0.0241 0.0679 0.1304 0.1011 0.0535 0.0579 0.0908 0.0780 0.0695 0.1589 0.1730
va: 2.5389 1.9686 3.0659 3.9274 3.8362 3.8566 3.8564 3.8554 3.8226 3.8794 3.9429 4.2173 3.9078 3.9723 1.0068 1.0089 1.0131 1.0062 1.0115 1.0050 1.0062 1.0201 1.0140 1.0119 1.0005 1.0298 1.0069 1.0090 1.0050 1.0015 1.0034 0.9991 0.9846
dispcorr: -0.014731736 hartree
energy: -958.878716732473
dipole: 23.33286 -22.71569 0.61717 -4.96464 5.39308 0.42844 4.50887 -2.56799 1.94088
magnitude: 2.08122 au
magnitude: 5.29004 debye
