program: Orca
programVersion: 4.2.1
elementType: S O N C C C C C C C C C C C H H H H H H H H H H H H H H H H H H H
charge: 0
multiplicity: 1
keywords: wb97x-d3
keywords: def2-TZVPP
keywords: def2/J RIJCOSX GRIDX6 NOFINALGRIDX
keywords: grid4 nofinalgrid
keywords: scfconv7
keywords: smallprint printgap noloewdin
keywords: NOSOSCF
formula: C11H19NOS
InChI: InChI=1/C11H19NOS/c1-2-3-4-5-6-7-9-12-11(13)8-10-14-12/h8,10H,2-7,9H2,1H3
33 atoms
S  -3.358638 -0.65387 0.328849
O  -1.862748 2.247442 -1.547565
N  -2.20353 0.207393 -0.561127
C  2.22197 -1.123616 1.382909
C  1.348154 -1.02227 0.138518
C  3.562088 -1.816364 1.148481
C  -0.029633 -0.447673 0.439708
C  4.485648 -1.13788 0.139651
C  -0.894106 -0.367872 -0.809546
C  4.898338 0.278948 0.520485
C  5.923661 0.868314 -0.43607
C  -2.580493 1.4781 -0.920304
C  -3.934422 1.71153 -0.439116
C  -4.443101 0.668666 0.234571
H  1.677476 -1.679166 2.153334
H  2.380877 -0.123445 1.798497
H  1.239847 -2.016581 -0.309381
H  1.838303 -0.400244 -0.617122
H  3.374537 -2.844255 0.820848
H  4.086899 -1.898766 2.105888
H  0.067686 0.552059 0.873016
H  -0.52392 -1.068983 1.193693
H  4.020339 -1.126363 -0.851734
H  5.386482 -1.751195 0.032018
H  -1.020424 -1.356347 -1.257855
H  -0.420039 0.261466 -1.562711
H  4.020537 0.931254 0.551023
H  5.306696 0.275881 1.536648
H  5.536899 0.914085 -1.456425
H  6.205543 1.882579 -0.148323
H  6.836484 0.269097 -0.459389
H  -4.454465 2.641117 -0.613954
H  -5.418554 0.587709 0.691908
elementType: S O N C H
totalener: -958.86491343 hartree
nucrepener: 974.92168313 hartree
electener: -1933.78659656 hartree
oneelecener: -3244.18449803 hartree
twoeener: 1310.39790147 hartree
cpcmener: -0.02068875 hartree
kineticenergy: 955.51276316 hartree
xcener: -75.344281341985 hartree
chargesum: 0.0000000
charge: 0.114606 -0.550677 -0.072804 -0.138633 -0.140191 -0.156697 -0.086103 -0.136352 -0.079811 -0.084418 -0.280166 0.316102 -0.270429 -0.069390 0.079056 0.070659 0.068569 0.070852 0.073149 0.075781 0.076714 0.064988 0.065115 0.073918 0.124018 0.097162 0.057418 0.059097 0.078246 0.090312 0.078328 0.160035 0.171550
qa: 0.1146 -0.5507 -0.0728 -0.1386 -0.1402 -0.1567 -0.0861 -0.1364 -0.0798 -0.0844 -0.2802 0.3161 -0.2704 -0.0694 0.0791 0.0707 0.0686 0.0709 0.0731 0.0758 0.0767 0.0650 0.0651 0.0739 0.1240 0.0972 0.0574 0.0591 0.0782 0.0903 0.0783 0.1600 0.1715
va: 2.5552 1.9651 3.0890 3.8715 3.8851 3.9160 3.8507 3.8653 3.7924 3.8519 3.9479 4.2120 3.9136 3.9946 1.0103 1.0019 1.0115 1.0072 1.0084 1.0078 1.0166 1.0209 1.0018 1.0092 1.0012 1.0340 1.0041 1.0071 1.0006 1.0033 1.0016 0.9980 0.9866
dispcorr: -0.012054212 hartree
energy: -958.876967637868
dipole: 37.80636 -38.58848 -0.78211 -5.60991 4.01488 -1.59503 4.23045 -3.05501 1.17544
magnitude: 2.13014 au
magnitude: 5.41438 debye
