program: Orca
programVersion: 4.2.1
elementType: S O N C C C C C C C C C C C H H H H H H H H H H H H H H H H H H H
charge: 0
multiplicity: 1
keywords: wb97x-d3
keywords: def2-TZVPP
keywords: def2/J RIJCOSX GRIDX6 NOFINALGRIDX
keywords: grid4 nofinalgrid
keywords: scfconv7
keywords: smallprint printgap noloewdin
keywords: NOSOSCF
formula: C11H19NOS
InChI: InChI=1/C11H19NOS/c1-2-3-4-5-6-7-9-12-11(13)8-10-14-12/h8,10H,2-7,9H2,1H3
33 atoms
S  -1.887895 0.603872 1.203219
O  -2.321254 0.314384 -2.5231
N  -1.971803 -0.148364 -0.311826
C  2.147127 -1.932691 -0.337584
C  0.741988 -1.579725 0.135189
C  3.227084 -1.748577 0.726886
C  -0.323049 -1.921578 -0.897517
C  3.299643 -0.358297 1.354743
C  -1.741861 -1.576266 -0.46973
C  3.529246 0.775496 0.362887
C  3.657445 2.128867 1.045928
C  -2.233148 0.695398 -1.361331
C  -2.383335 2.04727 -0.843843
C  -2.2232 2.123146 0.487194
H  2.38682 -1.337992 -1.224964
H  2.163711 -2.975862 -0.66946
H  0.697279 -0.512431 0.37042
H  0.524538 -2.1073 1.071218
H  4.199044 -1.993455 0.286576
H  3.066777 -2.482127 1.523651
H  -0.301895 -2.995992 -1.103585
H  -0.102857 -1.424208 -1.84622
H  4.110197 -0.354245 2.090908
H  2.386361 -0.158344 1.92527
H  -1.990484 -2.068642 0.472321
H  -2.458269 -1.939707 -1.207069
H  4.432915 0.572163 -0.220943
H  2.707551 0.816937 -0.358031
H  2.756334 2.374306 1.612291
H  4.496683 2.14584 1.744483
H  3.816444 2.930978 0.323376
H  -2.60199 2.888433 -1.484415
H  -2.283562 3.002495 1.112451
elementType: S O N C H
totalener: -958.86413032 hartree
nucrepener: 1026.57608997 hartree
electener: -1985.44022029 hartree
oneelecener: -3347.51529339 hartree
twoeener: 1362.07507311 hartree
cpcmener: -0.02056841 hartree
kineticenergy: 955.50485244 hartree
xcener: -75.344062416740 hartree
chargesum: 0.0000000
charge: 0.115763 -0.550968 -0.073423 -0.139713 -0.130831 -0.162668 -0.087869 -0.124616 -0.102634 -0.091636 -0.275179 0.325714 -0.276652 -0.060748 0.073300 0.076961 0.047600 0.076953 0.075818 0.072723 0.079042 0.072854 0.076995 0.059505 0.118644 0.111633 0.062323 0.055173 0.074675 0.078817 0.090844 0.158663 0.172937
qa: 0.1158 -0.5510 -0.0734 -0.1397 -0.1308 -0.1627 -0.0879 -0.1246 -0.1026 -0.0916 -0.2752 0.3257 -0.2767 -0.0607 0.0733 0.0770 0.0476 0.0770 0.0758 0.0727 0.0790 0.0729 0.0770 0.0595 0.1186 0.1116 0.0623 0.0552 0.0747 0.0788 0.0908 0.1587 0.1729
va: 2.5522 1.9614 3.0728 3.8890 3.8514 3.9126 3.7915 3.8580 3.8823 3.8557 3.9450 4.1996 3.9251 3.9746 1.0004 1.0118 1.0081 1.0072 1.0087 1.0077 1.0172 1.0252 1.0092 1.0024 1.0011 1.0204 1.0074 1.0041 1.0020 1.0016 1.0035 0.9996 0.9849
dispcorr: -0.013542939 hartree
energy: -958.877673254693
dipole: 26.66724 -26.30186 0.36538 -5.32461 5.48560 0.16099 4.01029 -1.96979 2.04050
magnitude: 2.07920 au
magnitude: 5.28490 debye
