program: Orca
programVersion: 4.2.1
elementType: S O N C C C C C C C C C C C H H H H H H H H H H H H H H H H H H H
charge: 0
multiplicity: 1
keywords: wb97x-d3
keywords: def2-TZVPP
keywords: def2/J RIJCOSX GRIDX6 NOFINALGRIDX
keywords: grid4 nofinalgrid
keywords: scfconv7
keywords: smallprint printgap noloewdin
keywords: NOSOSCF
formula: C11H19NOS
InChI: InChI=1/C11H19NOS/c1-2-3-4-5-6-7-9-12-11(13)8-10-14-12/h8,10H,2-7,9H2,1H3
33 atoms
S  -1.356643 0.685218 1.163935
O  -2.244483 0.142278 -2.455868
N  -1.781608 -0.17563 -0.232663
C  2.025624 -2.253869 -0.529868
C  0.597172 -1.9354 -0.966239
C  2.548345 -1.402559 0.627394
C  -0.454826 -2.241035 0.093739
C  2.550931 0.095976 0.349641
C  -1.81604 -1.628649 -0.20527
C  3.128486 0.917944 1.494345
C  3.082096 2.414277 1.226653
C  -1.949036 0.595734 -1.357389
C  -1.719044 1.988725 -1.00095
C  -1.39429 2.157844 0.289609
H  2.688913 -2.121902 -1.390529
H  2.096345 -3.31161 -0.256184
H  0.361885 -2.503875 -1.870529
H  0.542159 -0.883642 -1.259657
H  3.568321 -1.725211 0.860216
H  1.966168 -1.59809 1.534011
H  -0.121551 -1.906739 1.080844
H  -0.590508 -3.322297 0.182811
H  1.530548 0.442383 0.15629
H  3.116962 0.297309 -0.56731
H  -2.555624 -1.955385 0.528728
H  -2.177636 -1.944292 -1.183812
H  2.57473 0.696865 2.412557
H  4.161867 0.610076 1.682905
H  3.648694 2.677842 0.331023
H  2.055759 2.758086 1.076385
H  3.499973 2.985611 2.057326
H  -1.799913 2.787142 -1.722841
H  -1.178308 3.083812 0.802611
elementType: S O N C H
totalener: -958.86339904 hartree
nucrepener: 1059.50245650 hartree
electener: -2018.36585554 hartree
oneelecener: -3413.29156562 hartree
twoeener: 1394.92571009 hartree
cpcmener: -0.02059341 hartree
kineticenergy: 955.51426533 hartree
xcener: -75.347440250799 hartree
chargesum: -0.0000000
charge: 0.107322 -0.545126 -0.068188 -0.152128 -0.139484 -0.123881 -0.138993 -0.102503 -0.086670 -0.091308 -0.267854 0.300568 -0.256132 -0.065831 0.076569 0.074197 0.090713 0.073042 0.077025 0.062307 0.075584 0.089556 0.023090 0.070653 0.130821 0.101034 0.053392 0.059973 0.078664 0.069363 0.091463 0.158548 0.174214
qa: 0.1073 -0.5451 -0.0682 -0.1521 -0.1395 -0.1239 -0.1390 -0.1025 -0.0867 -0.0913 -0.2679 0.3006 -0.2561 -0.0658 0.0766 0.0742 0.0907 0.0730 0.0770 0.0623 0.0756 0.0896 0.0231 0.0707 0.1308 0.1010 0.0534 0.0600 0.0787 0.0694 0.0915 0.1585 0.1742
va: 2.5402 1.9676 3.0686 3.9282 3.8471 3.8548 3.8616 3.8677 3.8211 3.8745 3.9434 4.2183 3.9016 3.9696 1.0073 1.0082 1.0114 1.0032 1.0118 1.0079 1.0053 1.0193 1.0109 1.0132 1.0002 1.0299 1.0076 1.0094 1.0015 1.0018 1.0051 0.9995 0.9841
dispcorr: -0.015335686 hartree
energy: -958.878734726541
dipole: 22.06576 -21.37679 0.68897 -4.75654 5.01196 0.25542 4.14854 -2.16760 1.98094
magnitude: 2.11283 au
magnitude: 5.37038 debye
