program: Orca
programVersion: 4.2.1
elementType: S O N C C C C C C C C C C C H H H H H H H H H H H H H H H H H H H
charge: 0
multiplicity: 1
keywords: wb97x-d3
keywords: def2-TZVPP
keywords: def2/J RIJCOSX GRIDX6 NOFINALGRIDX
keywords: grid4 nofinalgrid
keywords: scfconv7
keywords: smallprint printgap noloewdin
keywords: NOSOSCF
formula: C11H19NOS
InChI: InChI=1/C11H19NOS/c1-2-3-4-5-6-7-9-12-11(13)8-10-14-12/h8,10H,2-7,9H2,1H3
33 atoms
S  -1.409597 0.833495 -1.567749
O  -2.041495 0.010267 2.048939
N  -1.707262 -0.134335 -0.208267
C  2.149393 -2.218931 -0.222688
C  0.770639 -1.90773 -0.799613
C  2.502184 -1.442131 1.048528
C  -0.388855 -2.209532 0.143763
C  2.262833 0.064671 0.982351
C  -1.709991 -1.588488 -0.291439
C  3.02937 0.791429 -0.115639
C  2.749833 2.287209 -0.118295
C  -1.829457 0.554769 0.972027
C  -1.672454 1.975928 0.699692
C  -1.445361 2.242621 -0.596137
H  2.896206 -2.015275 -0.99524
H  2.227472 -3.289939 -0.011132
H  0.633649 -2.475668 -1.72476
H  0.749629 -0.856295 -1.097531
H  3.55408 -1.628822 1.286519
H  1.936559 -1.84404 1.893948
H  -0.16903 -1.873718 1.159175
H  -0.537153 -3.290994 0.210449
H  2.533838 0.499931 1.949559
H  1.192644 0.267681 0.863232
H  -2.525325 -1.94967 0.336028
H  -1.957349 -1.871168 -1.316178
H  4.10255 0.616149 0.010092
H  2.768913 0.380032 -1.095133
H  3.037338 2.748851 0.828562
H  3.295738 2.798583 -0.912538
H  1.686358 2.487383 -0.269776
H  -1.733535 2.722223 1.476991
H  -1.298419 3.209208 -1.055694
elementType: S O N C H
totalener: -958.86177746 hartree
nucrepener: 1074.99636390 hartree
electener: -2033.85814136 hartree
oneelecener: -3444.49448965 hartree
twoeener: 1410.63634829 hartree
cpcmener: -0.02041040 hartree
kineticenergy: 955.50662352 hartree
xcener: -75.348077999228 hartree
chargesum: -0.0000000
charge: 0.118125 -0.543217 -0.061091 -0.170413 -0.113598 -0.163506 -0.115664 -0.056999 -0.104931 -0.107928 -0.272863 0.311855 -0.264050 -0.067014 0.082225 0.076986 0.090287 0.035712 0.076067 0.079491 0.077397 0.086443 0.081759 -0.004102 0.112719 0.114786 0.065256 0.058561 0.082222 0.093054 0.068359 0.157058 0.177014
qa: 0.1181 -0.5432 -0.0611 -0.1704 -0.1136 -0.1635 -0.1157 -0.0570 -0.1049 -0.1079 -0.2729 0.3119 -0.2640 -0.0670 0.0822 0.0770 0.0903 0.0357 0.0761 0.0795 0.0774 0.0864 0.0818 -0.0041 0.1127 0.1148 0.0653 0.0586 0.0822 0.0931 0.0684 0.1571 0.1770
va: 2.5500 1.9695 3.0495 3.9233 3.8398 3.9012 3.7752 3.8453 3.9026 3.8589 3.9462 4.1834 3.9101 3.9607 0.9996 1.0096 1.0120 1.0250 1.0091 1.0027 1.0284 1.0177 1.0123 1.0272 1.0166 0.9994 1.0087 1.0029 1.0025 1.0048 1.0006 1.0015 0.9838
dispcorr: -0.016489598 hartree
energy: -958.878267058899
dipole: 21.18674 -20.64594 0.54080 -5.24043 5.66957 0.42915 1.38250 -3.34934 -1.96684
magnitude: 2.08449 au
magnitude: 5.29836 debye
