program: Orca
programVersion: 4.2.1
elementType: S O N C C C C C C C C C C C H H H H H H H H H H H H H H H H H H H
charge: 0
multiplicity: 1
keywords: wb97x-d3
keywords: def2-TZVPP
keywords: def2/J RIJCOSX GRIDX6 NOFINALGRIDX
keywords: grid4 nofinalgrid
keywords: scfconv7
keywords: smallprint printgap noloewdin
keywords: NOSOSCF
formula: C11H19NOS
InChI: InChI=1/C11H19NOS/c1-2-3-4-5-6-7-9-12-11(13)8-10-14-12/h8,10H,2-7,9H2,1H3
33 atoms
S  -3.201793 -0.523571 -0.00743
O  -0.386364 1.88818 -0.682201
N  -1.671584 -0.005589 -0.521433
C  1.471142 -0.674114 1.161355
C  0.223358 -1.548412 1.265566
C  2.668722 -1.359561 0.512498
C  -0.339952 -2.053975 -0.059219
C  3.905784 -0.468847 0.4192
C  -0.722816 -0.966045 -1.054716
C  3.776012 0.67054 -0.586651
C  5.022022 1.541072 -0.652737
C  -1.432632 1.337815 -0.360668
C  -2.61329 1.949458 0.233783
C  -3.604245 1.0754 0.462062
H  1.753899 -0.364129 2.172446
H  1.23109 0.249158 0.629539
H  -0.55319 -0.991819 1.799254
H  0.444327 -2.418733 1.890834
H  2.412222 -1.707294 -0.49374
H  2.913671 -2.259051 1.086922
H  -1.208714 -2.688603 0.142532
H  0.379072 -2.705753 -0.561371
H  4.767966 -1.083634 0.140867
H  4.136361 -0.059398 1.409375
H  -1.138302 -1.418721 -1.957999
H  0.14795 -0.390683 -1.366427
H  3.572505 0.250063 -1.576938
H  2.913141 1.296709 -0.343038
H  5.903991 0.956203 -0.922648
H  4.917024 2.33521 -1.393703
H  5.22653 2.01672 0.308766
H  -2.662016 3.004658 0.456585
H  -4.576369 1.273201 0.889753
elementType: S O N C H
totalener: -958.86294873 hartree
nucrepener: 1033.20946000 hartree
electener: -1992.07240874 hartree
oneelecener: -3361.26477448 hartree
twoeener: 1369.19236575 hartree
cpcmener: -0.01883117 hartree
kineticenergy: 955.50679058 hartree
xcener: -75.346236280606 hartree
chargesum: 0.0000000
charge: 0.110300 -0.538534 -0.066686 -0.109577 -0.145043 -0.131652 -0.165977 -0.136156 -0.091592 -0.068348 -0.287107 0.307193 -0.264549 -0.066896 0.078199 0.050642 0.072965 0.082366 0.062353 0.076271 0.090922 0.089783 0.072481 0.057152 0.136253 0.099931 0.054674 0.051258 0.077720 0.090911 0.078489 0.158713 0.173542
qa: 0.1103 -0.5385 -0.0667 -0.1096 -0.1450 -0.1317 -0.1660 -0.1362 -0.0916 -0.0683 -0.2871 0.3072 -0.2645 -0.0669 0.0782 0.0506 0.0730 0.0824 0.0624 0.0763 0.0909 0.0898 0.0725 0.0572 0.1363 0.0999 0.0547 0.0513 0.0777 0.0909 0.0785 0.1587 0.1735
va: 2.5576 1.9747 3.0737 3.8425 3.8902 3.8846 3.8788 3.9089 3.8038 3.8480 3.9516 4.2002 3.9211 3.9971 1.0134 1.0213 1.0124 1.0101 1.0083 1.0106 1.0059 1.0117 1.0081 1.0084 1.0026 1.0256 1.0063 1.0142 1.0012 1.0028 1.0007 0.9989 0.9853
dispcorr: -0.014330182 hartree
energy: -958.877278915510
dipole: 28.85831 -30.41227 -1.55396 -4.59205 3.26321 -1.32884 2.15760 -1.67411 0.48349
magnitude: 2.10105 au
magnitude: 5.34043 debye
