program: Orca
programVersion: 4.2.1
elementType: S O N C C C C C C C C C C C H H H H H H H H H H H H H H H H H H H
charge: 0
multiplicity: 1
keywords: wb97x-d3
keywords: def2-TZVPP
keywords: def2/J RIJCOSX GRIDX6 NOFINALGRIDX
keywords: grid4 nofinalgrid
keywords: scfconv7
keywords: smallprint printgap noloewdin
keywords: NOSOSCF
formula: C11H19NOS
InChI: InChI=1/C11H19NOS/c1-2-3-4-5-6-7-9-12-11(13)8-10-14-12/h8,10H,2-7,9H2,1H3
33 atoms
S  -3.153204 -0.145767 0.744786
O  -0.728542 1.032606 -1.886828
N  -1.997706 -0.27015 -0.487391
C  1.540545 -1.223767 -0.101905
C  0.393632 -1.533471 0.852703
C  2.684123 -0.478781 0.577654
C  -0.76277 -2.305646 0.227806
C  3.806816 -0.11549 -0.38752
C  -1.500273 -1.573041 -0.888041
C  4.996704 0.588122 0.259578
C  4.664122 1.945468 0.864249
C  -1.561713 0.931603 -0.994409
C  -2.257144 2.005793 -0.299411
C  -3.115139 1.565335 0.632288
H  1.181242 -0.62199 -0.940864
H  1.91685 -2.15794 -0.533383
H  0.021618 -0.601414 1.291452
H  0.777064 -2.120143 1.69274
H  3.087732 -1.089819 1.393358
H  2.284776 0.426665 1.045972
H  -1.474685 -2.587323 1.010168
H  -0.400412 -3.248296 -0.191939
H  3.40469 0.518142 -1.186238
H  4.160656 -1.028196 -0.878124
H  -2.332934 -2.181587 -1.24729
H  -0.850847 -1.400327 -1.744324
H  5.428385 -0.059183 1.029516
H  5.777992 0.719072 -0.494299
H  4.21624 2.610957 0.122555
H  3.965145 1.866304 1.698133
H  5.560663 2.438263 1.244407
H  -2.08047 3.04569 -0.530769
H  -3.750026 2.152262 1.280634
elementType: S O N C H
totalener: -958.86450301 hartree
nucrepener: 1019.48695678 hartree
electener: -1978.35145979 hartree
oneelecener: -3333.79747022 hartree
twoeener: 1355.44601043 hartree
cpcmener: -0.01928616 hartree
kineticenergy: 955.50450592 hartree
xcener: -75.344115705442 hartree
chargesum: -0.0000000
charge: 0.111940 -0.540163 -0.062553 -0.125069 -0.098045 -0.123254 -0.159896 -0.109476 -0.111333 -0.114304 -0.279570 0.305561 -0.262320 -0.065460 0.054442 0.068350 0.056761 0.082374 0.061947 0.060824 0.089309 0.081783 0.062630 0.065955 0.134108 0.108852 0.054412 0.070224 0.080948 0.078924 0.091925 0.157956 0.172217
qa: 0.1119 -0.5402 -0.0626 -0.1251 -0.0980 -0.1233 -0.1599 -0.1095 -0.1113 -0.1143 -0.2796 0.3056 -0.2623 -0.0655 0.0544 0.0683 0.0568 0.0824 0.0619 0.0608 0.0893 0.0818 0.0626 0.0660 0.1341 0.1089 0.0544 0.0702 0.0809 0.0789 0.0919 0.1580 0.1722
va: 2.5576 1.9759 3.0668 3.8478 3.8491 3.8727 3.8966 3.8755 3.8135 3.8972 3.9269 4.2023 3.9197 3.9970 1.0302 1.0138 1.0143 1.0121 1.0099 1.0073 1.0052 1.0187 1.0089 1.0117 1.0012 1.0188 1.0082 1.0065 1.0004 0.9983 1.0043 0.9993 0.9859
dispcorr: -0.013483811 hartree
energy: -958.877986821234
dipole: 29.28908 -30.52506 -1.23598 -3.29522 2.65932 -0.63589 3.76831 -2.25534 1.51297
magnitude: 2.05453 au
magnitude: 5.22220 debye
