program: Orca
programVersion: 4.2.1
elementType: S O N C C C C C C C C C C C H H H H H H H H H H H H H H H H H H H
charge: 0
multiplicity: 1
keywords: wb97x-d3
keywords: def2-TZVPP
keywords: def2/J RIJCOSX GRIDX6 NOFINALGRIDX
keywords: grid4 nofinalgrid
keywords: scfconv7
keywords: smallprint printgap noloewdin
keywords: NOSOSCF
formula: C11H19NOS
InChI: InChI=1/C11H19NOS/c1-2-3-4-5-6-7-9-12-11(13)8-10-14-12/h8,10H,2-7,9H2,1H3
33 atoms
S  -3.596087 -0.810523 0.169475
O  -1.82333 2.097485 -1.43549
N  -2.304691 0.071138 -0.481768
C  2.100131 -0.166533 0.305819
C  1.049123 -0.984339 1.048548
C  3.510986 -0.712116 0.491438
C  -0.362605 -0.410215 0.98105
C  4.566406 0.109722 -0.239068
C  -0.953561 -0.455416 -0.421557
C  5.983423 -0.447996 -0.136218
C  6.547782 -0.462423 1.277387
C  -2.636159 1.316324 -0.956406
C  -4.069539 1.508301 -0.788396
C  -4.678135 0.463651 -0.206971
H  2.062464 0.870676 0.65718
H  1.870658 -0.13187 -0.764111
H  1.337272 -1.057223 2.101287
H  1.044532 -2.011513 0.667718
H  3.549887 -1.748458 0.136488
H  3.737942 -0.749914 1.56159
H  -0.363195 0.623367 1.33961
H  -1.006707 -0.975611 1.66103
H  4.553737 1.137262 0.141701
H  4.291557 0.178337 -1.296747
H  -0.955109 -1.478601 -0.805578
H  -0.365513 0.139953 -1.118755
H  6.004287 -1.462126 -0.54827
H  6.642019 0.148277 -0.77413
H  5.9893 -1.126059 1.93931
H  7.584537 -0.803114 1.2837
H  6.529739 0.535473 1.721697
H  -4.569077 2.411965 -1.103266
H  -5.7267 0.355463 0.0299
elementType: S O N C H
totalener: -958.86484506 hartree
nucrepener: 967.50706999 hartree
electener: -1926.37191505 hartree
oneelecener: -3229.47776149 hartree
twoeener: 1303.10584644 hartree
cpcmener: -0.02068617 hartree
kineticenergy: 955.50972458 hartree
xcener: -75.343283133315 hartree
chargesum: 0.0000000
charge: 0.115219 -0.549646 -0.072823 -0.115276 -0.129457 -0.128384 -0.115346 -0.108381 -0.081157 -0.114310 -0.277301 0.314998 -0.267644 -0.070594 0.062705 0.061073 0.075108 0.066223 0.059196 0.062674 0.079241 0.079198 0.061075 0.067776 0.125646 0.093586 0.054358 0.070082 0.078916 0.091221 0.080072 0.160004 0.171952
qa: 0.1152 -0.5496 -0.0728 -0.1153 -0.1295 -0.1284 -0.1153 -0.1084 -0.0812 -0.1143 -0.2773 0.3150 -0.2676 -0.0706 0.0627 0.0611 0.0751 0.0662 0.0592 0.0627 0.0792 0.0792 0.0611 0.0678 0.1256 0.0936 0.0544 0.0701 0.0789 0.0912 0.0801 0.1600 0.1720
va: 2.5545 1.9667 3.0935 3.8832 3.9039 3.8814 3.8762 3.8752 3.7900 3.8973 3.9269 4.2096 3.9150 3.9955 1.0086 1.0121 1.0102 1.0093 1.0080 1.0082 1.0144 1.0194 1.0086 1.0121 1.0011 1.0345 1.0081 1.0065 0.9987 1.0045 1.0004 0.9981 0.9863
dispcorr: -0.011846825 hartree
energy: -958.876691889832
dipole: 39.78154 -40.72561 -0.94408 -4.81165 3.23424 -1.57741 6.47230 -5.50419 0.96811
magnitude: 2.07768 au
magnitude: 5.28103 debye
