program: Orca
programVersion: 4.2.1
elementType: S O N C C C C C C C C C C C H H H H H H H H H H H H H H H H H H H
charge: 0
multiplicity: 1
keywords: wb97x-d3
keywords: def2-TZVPP
keywords: def2/J RIJCOSX GRIDX6 NOFINALGRIDX
keywords: grid4 nofinalgrid
keywords: scfconv7
keywords: smallprint printgap noloewdin
keywords: NOSOSCF
formula: C11H19NOS
InChI: InChI=1/C11H19NOS/c1-2-3-4-5-6-7-9-12-11(13)8-10-14-12/h8,10H,2-7,9H2,1H3
33 atoms
S  -3.075389 -0.238341 -1.101647
O  -0.958961 1.208357 1.658265
N  -2.056457 -0.2342 0.251861
C  1.525632 -1.175457 0.386015
C  0.504747 -1.553483 -0.680196
C  2.760699 -0.495006 -0.192777
C  -0.719205 -2.291134 -0.149585
C  3.759589 -0.078605 0.880365
C  -1.58946 -1.489721 0.811245
C  5.047067 0.539494 0.342586
C  4.844099 1.850242 -0.404569
C  -1.690291 1.013666 0.695332
C  -2.320026 2.010673 -0.159125
C  -3.069643 1.475266 -1.133876
H  1.828132 -2.075521 0.933331
H  1.070993 -0.507525 1.123186
H  0.987654 -2.19301 -1.425369
H  0.190698 -0.655373 -1.222874
H  2.444067 0.379866 -0.769518
H  3.250973 -1.168318 -0.905293
H  -0.40843 -3.196339 0.380068
H  -1.328064 -2.637468 -0.990577
H  4.015534 -0.955398 1.484388
H  3.278174 0.628094 1.565691
H  -1.04534 -1.234605 1.719203
H  -2.450624 -2.086066 1.120942
H  5.729823 0.710951 1.179649
H  5.549367 -0.180142 -0.312029
H  4.249465 1.722055 -1.31034
H  4.335115 2.587716 0.220337
H  5.799109 2.282987 -0.707384
H  -2.181126 3.069586 -0.002115
H  -3.637744 1.992252 -1.893585
elementType: S O N C H
totalener: -958.86443606 hartree
nucrepener: 1017.53999206 hartree
electener: -1976.40442812 hartree
oneelecener: -3329.90260890 hartree
twoeener: 1353.49818078 hartree
cpcmener: -0.01928030 hartree
kineticenergy: 955.51189350 hartree
xcener: -75.345133746425 hartree
chargesum: -0.0000000
charge: 0.112213 -0.539966 -0.063749 -0.125564 -0.096314 -0.122086 -0.159776 -0.109857 -0.110567 -0.113287 -0.278705 0.305123 -0.262749 -0.066424 0.066809 0.054854 0.081888 0.057437 0.061128 0.061274 0.081226 0.089287 0.065214 0.063228 0.108350 0.134684 0.069612 0.054116 0.078018 0.080889 0.092232 0.158405 0.173057
qa: 0.1122 -0.5400 -0.0637 -0.1256 -0.0963 -0.1221 -0.1598 -0.1099 -0.1106 -0.1133 -0.2787 0.3051 -0.2627 -0.0664 0.0668 0.0549 0.0819 0.0574 0.0611 0.0613 0.0812 0.0893 0.0652 0.0632 0.1084 0.1347 0.0696 0.0541 0.0780 0.0809 0.0922 0.1584 0.1731
va: 2.5587 1.9762 3.0672 3.8518 3.8472 3.8717 3.8987 3.8743 3.8137 3.8978 3.9270 4.2036 3.9192 3.9969 1.0137 1.0296 1.0119 1.0146 1.0075 1.0100 1.0187 1.0056 1.0118 1.0087 1.0188 1.0009 1.0068 1.0083 0.9987 1.0004 1.0041 0.9991 0.9856
dispcorr: -0.013428683 hartree
energy: -958.877864742247
dipole: 29.95615 -31.01618 -1.06004 -3.48714 2.69487 -0.79228 0.26079 -1.83604 -1.57525
magnitude: 2.05737 au
magnitude: 5.22942 debye
