program: Orca
programVersion: 4.2.1
elementType: S O N C C C C C C C C C C C H H H H H H H H H H H H H H H H H H H
charge: 0
multiplicity: 1
keywords: wb97x-d3
keywords: def2-TZVPP
keywords: def2/J RIJCOSX GRIDX6 NOFINALGRIDX
keywords: grid4 nofinalgrid
keywords: scfconv7
keywords: smallprint printgap noloewdin
keywords: NOSOSCF
formula: C11H19NOS
InChI: InChI=1/C11H19NOS/c1-2-3-4-5-6-7-9-12-11(13)8-10-14-12/h8,10H,2-7,9H2,1H3
33 atoms
S  -2.814647 0.122162 -1.248072
O  -0.973378 0.59232 2.00571
N  -1.977555 -0.325754 0.157425
C  1.526582 -1.549521 0.560768
C  0.689893 -1.476685 -0.711771
C  2.870668 -0.833256 0.460856
C  -0.62093 -2.251525 -0.639492
C  2.75392 0.67686 0.271813
C  -1.628554 -1.719494 0.372837
C  4.074471 1.42413 0.437276
C  5.12999 1.054772 -0.595437
C  -1.590909 0.721945 0.955881
C  -2.046028 1.962879 0.343934
C  -2.699582 1.774534 -0.81211
H  1.702418 -2.602615 0.805998
H  0.969528 -1.12847 1.402164
H  1.275953 -1.877914 -1.544759
H  0.482339 -0.434373 -0.972365
H  3.454746 -1.272442 -0.354323
H  3.436658 -1.029751 1.377922
H  -0.423654 -3.29527 -0.377473
H  -1.083204 -2.277372 -1.631001
H  2.029648 1.067626 0.995022
H  2.342146 0.902279 -0.717341
H  -1.24376 -1.78567 1.389196
H  -2.539864 -2.320677 0.343297
H  3.881752 2.499269 0.37891
H  4.469458 1.24362 1.442359
H  6.029605 1.660611 -0.473754
H  5.43481 0.00992 -0.518073
H  4.763275 1.215382 -1.611923
H  -1.863302 2.925933 0.795573
H  -3.136897 2.525195 -1.453875
elementType: S O N C H
totalener: -958.86312900 hartree
nucrepener: 1035.55840657 hartree
electener: -1994.42153557 hartree
oneelecener: -3365.96686703 hartree
twoeener: 1371.54533145 hartree
cpcmener: -0.01886300 hartree
kineticenergy: 955.50970251 hartree
xcener: -75.345646211057 hartree
chargesum: 0.0000000
charge: 0.113822 -0.539058 -0.065392 -0.134926 -0.098596 -0.143289 -0.160424 -0.099473 -0.104108 -0.119545 -0.274571 0.301347 -0.262755 -0.063412 0.075434 0.063569 0.084376 0.055558 0.063429 0.072535 0.079305 0.087399 0.061993 0.059971 0.108888 0.133881 0.067865 0.055148 0.091750 0.078987 0.079059 0.158662 0.172573
qa: 0.1138 -0.5391 -0.0654 -0.1349 -0.0986 -0.1433 -0.1604 -0.0995 -0.1041 -0.1195 -0.2746 0.3013 -0.2628 -0.0634 0.0754 0.0636 0.0844 0.0556 0.0634 0.0725 0.0793 0.0874 0.0620 0.0600 0.1089 0.1339 0.0679 0.0551 0.0917 0.0790 0.0791 0.1587 0.1726
va: 2.5561 1.9718 3.0725 3.8749 3.8320 3.8995 3.9156 3.8513 3.8060 3.9115 3.9250 4.1997 3.9232 3.9924 1.0123 1.0318 1.0110 1.0148 1.0068 1.0085 1.0194 1.0071 1.0248 1.0071 1.0179 1.0018 1.0065 1.0087 1.0046 0.9994 1.0006 0.9993 0.9854
dispcorr: -0.014380718 hartree
energy: -958.877509714424
dipole: 28.32470 -29.24936 -0.92466 -3.91238 3.70358 -0.20880 -0.72096 -1.10407 -1.82503
magnitude: 2.05653 au
magnitude: 5.22728 debye
