program: Orca
programVersion: 4.2.1
elementType: S O N C C C C C C C C C C C H H H H H H H H H H H H H H H H H H H
charge: 0
multiplicity: 1
keywords: wb97x-d3
keywords: def2-TZVPP
keywords: def2/J RIJCOSX GRIDX6 NOFINALGRIDX
keywords: grid4 nofinalgrid
keywords: scfconv7
keywords: smallprint printgap noloewdin
keywords: NOSOSCF
formula: C11H19NOS
InChI: InChI=1/C11H19NOS/c1-2-3-4-5-6-7-9-12-11(13)8-10-14-12/h8,10H,2-7,9H2,1H3
33 atoms
S  -2.263346 0.146972 -1.612685
O  -1.900062 0.421008 2.12606
N  -2.048262 -0.38148 -0.016715
C  1.12103 -0.655307 0.018007
C  0.687205 -2.112151 0.140413
C  2.587362 -0.441093 0.376721
C  -0.691521 -2.452997 -0.418637
C  2.98797 1.028966 0.318858
C  -1.886134 -1.798133 0.264837
C  4.421255 1.317058 0.755886
C  5.482915 0.708915 -0.14957
C  -2.041645 0.617375 0.924844
C  -2.217733 1.894002 0.247781
C  -2.343561 1.773585 -1.082184
H  0.515023 -0.027545 0.6745
H  0.943259 -0.299643 -1.002862
H  0.73319 -2.415913 1.191319
H  1.414675 -2.739771 -0.384416
H  3.214388 -1.032981 -0.297595
H  2.774422 -0.82711 1.385336
H  -0.843422 -3.53108 -0.322575
H  -0.717619 -2.252493 -1.494883
H  2.305265 1.601934 0.954763
H  2.837585 1.405288 -0.699246
H  -1.802322 -1.887119 1.347809
H  -2.802872 -2.316822 -0.024872
H  4.565251 2.400583 0.791717
H  4.566489 0.960578 1.780587
H  6.485389 0.996972 0.171321
H  5.447809 -0.381511 -0.152519
H  5.361948 1.044497 -1.18201
H  -2.237298 2.830692 0.783757
H  -2.483026 2.561768 -1.807645
elementType: S O N C H
totalener: -958.86253941 hartree
nucrepener: 1027.68095664 hartree
electener: -1986.54349604 hartree
oneelecener: -3349.99656567 hartree
twoeener: 1363.45306963 hartree
cpcmener: -0.02035830 hartree
kineticenergy: 955.51168172 hartree
xcener: -75.345267600657 hartree
chargesum: 0.0000000
charge: 0.109931 -0.543822 -0.050878 -0.104346 -0.100041 -0.132770 -0.150185 -0.102790 -0.096862 -0.115207 -0.276612 0.287269 -0.264935 -0.059409 0.046641 0.058025 0.067298 0.071165 0.063565 0.060770 0.090991 0.072490 0.067755 0.060201 0.101747 0.135772 0.069464 0.054896 0.091232 0.078711 0.078855 0.158698 0.172381
qa: 0.1099 -0.5438 -0.0509 -0.1043 -0.1000 -0.1328 -0.1502 -0.1028 -0.0969 -0.1152 -0.2766 0.2873 -0.2649 -0.0594 0.0466 0.0580 0.0673 0.0712 0.0636 0.0608 0.0910 0.0725 0.0678 0.0602 0.1017 0.1358 0.0695 0.0549 0.0912 0.0787 0.0789 0.1587 0.1724
va: 2.5576 1.9689 3.0664 3.8945 3.8564 3.9072 3.9066 3.8676 3.8253 3.9035 3.9268 4.2212 3.9142 3.9851 1.0206 1.0149 1.0094 1.0090 1.0098 1.0089 1.0141 1.0092 1.0119 1.0078 1.0289 0.9994 1.0066 1.0082 1.0043 0.9992 1.0005 0.9996 0.9852
dispcorr: -0.013873593 hartree
energy: -958.876412999471
dipole: 28.74611 -28.84978 -0.10367 -3.72861 3.58868 -0.13993 1.63596 -3.71479 -2.07883
magnitude: 2.08611 au
magnitude: 5.30248 debye
