program: Orca
programVersion: 4.2.1
elementType: S O N C C C C C C C C C C C H H H H H H H H H H H H H H H H H H H
charge: 0
multiplicity: 1
keywords: wb97x-d3
keywords: def2-TZVPP
keywords: def2/J RIJCOSX GRIDX6 NOFINALGRIDX
keywords: grid4 nofinalgrid
keywords: scfconv7
keywords: smallprint printgap noloewdin
keywords: NOSOSCF
formula: C11H19NOS
InChI: InChI=1/C11H19NOS/c1-2-3-4-5-6-7-9-12-11(13)8-10-14-12/h8,10H,2-7,9H2,1H3
33 atoms
S  -1.389871 0.622918 1.14726
O  -2.108019 0.109175 -2.513478
N  -1.775752 -0.2230 -0.269191
C  1.985868 -2.098487 -0.261865
C  0.590094 -2.049774 -0.881432
C  2.297827 -0.948158 0.697513
C  -0.531533 -2.32478 0.120466
C  2.344987 0.423541 0.031928
C  -1.858837 -1.673383 -0.244691
C  2.542026 1.583099 1.004466
C  3.860597 1.548785 1.764552
C  -1.855209 0.553891 -1.400995
C  -1.589923 1.937473 -1.032051
C  -1.327076 2.095514 0.273664
H  2.732222 -2.102012 -1.062443
H  2.111071 -3.049072 0.266851
H  0.526908 -2.778163 -1.693832
H  0.446587 -1.076659 -1.357373
H  3.258951 -1.15591 1.175203
H  1.563754 -0.925268 1.51038
H  -0.242321 -1.998633 1.124293
H  -0.701813 -3.400701 0.205884
H  1.417073 0.599838 -0.519586
H  3.145309 0.435197 -0.716661
H  -2.640504 -1.976403 0.454961
H  -2.184949 -1.979059 -1.238379
H  2.476603 2.52216 0.447644
H  1.710351 1.598785 1.716303
H  3.97868 2.436229 2.388867
H  3.934929 0.682165 2.423331
H  4.712393 1.515617 1.081163
H  -1.601998 2.737033 -1.75745
H  -1.101096 3.012488 0.798513
elementType: S O N C H
totalener: -958.86075689 hartree
nucrepener: 1070.75534273 hartree
electener: -2029.61609963 hartree
oneelecener: -3435.81037044 hartree
twoeener: 1406.19427081 hartree
cpcmener: -0.02024228 hartree
kineticenergy: 955.50894054 hartree
xcener: -75.347999856366 hartree
chargesum: -0.0000000
charge: 0.109154 -0.542185 -0.059762 -0.146271 -0.155551 -0.133621 -0.143425 -0.126143 -0.085879 -0.108573 -0.275518 0.290714 -0.254538 -0.064075 0.073645 0.077749 0.094091 0.074828 0.083953 0.061159 0.077437 0.094266 0.053141 0.078047 0.129944 0.102344 0.072486 0.041070 0.091345 0.079333 0.080814 0.157160 0.172863
qa: 0.1092 -0.5422 -0.0598 -0.1463 -0.1556 -0.1336 -0.1434 -0.1261 -0.0859 -0.1086 -0.2755 0.2907 -0.2545 -0.0641 0.0736 0.0777 0.0941 0.0748 0.0840 0.0612 0.0774 0.0943 0.0531 0.0780 0.1299 0.1023 0.0725 0.0411 0.0913 0.0793 0.0808 0.1572 0.1729
va: 2.5470 1.9712 3.0694 3.9266 3.8625 3.8519 3.8621 3.8536 3.8316 3.8656 3.9446 4.2297 3.8914 3.9708 1.0082 1.0056 1.0094 1.0025 1.0107 1.0122 1.0033 1.0170 1.0173 1.0135 1.0003 1.0279 1.0057 1.0195 1.0043 0.9981 1.0004 1.0007 0.9851
dispcorr: -0.016247335 hartree
energy: -958.877004226809
dipole: 22.24056 -21.66702 0.57353 -4.80187 5.07599 0.27412 4.93935 -2.95361 1.98574
magnitude: 2.08500 au
magnitude: 5.29965 debye
