program: Orca
programVersion: 4.2.1
elementType: S O N C C C C C C C C C C C H H H H H H H H H H H H H H H H H H H
charge: 0
multiplicity: 1
keywords: wb97x-d3
keywords: def2-TZVPP
keywords: def2/J RIJCOSX GRIDX6 NOFINALGRIDX
keywords: grid4 nofinalgrid
keywords: scfconv7
keywords: smallprint printgap noloewdin
keywords: NOSOSCF
formula: C11H19NOS
InChI: InChI=1/C11H19NOS/c1-2-3-4-5-6-7-9-12-11(13)8-10-14-12/h8,10H,2-7,9H2,1H3
33 atoms
S  -2.498656 0.314084 1.179451
O  -2.682004 0.020813 -2.570864
N  -2.267438 -0.375043 -0.350532
C  2.185419 -0.227309 -0.608773
C  0.694457 -0.338519 -0.91425
C  2.494347 0.249834 0.80727
C  -0.022668 -1.404094 -0.096012
C  3.965524 0.578428 1.04469
C  -1.481486 -1.588911 -0.487006
C  4.901178 -0.622202 0.960606
C  6.34337 -0.264415 1.285552
C  -2.774405 0.35654 -1.39658
C  -3.417822 1.546684 -0.858254
C  -3.332406 1.635602 0.477524
H  2.634791 0.472666 -1.320994
H  2.661574 -1.194904 -0.796638
H  0.562176 -0.560613 -1.977768
H  0.225166 0.636997 -0.748739
H  2.176015 -0.500394 1.538701
H  1.895489 1.143417 1.014221
H  0.046587 -1.182578 0.973354
H  0.471107 -2.371053 -0.231366
H  4.070302 1.036996 2.033675
H  4.286926 1.340169 0.324978
H  -1.941965 -2.381612 0.106667
H  -1.561766 -1.887419 -1.532044
H  4.553315 -1.398587 1.650074
H  4.858199 -1.064128 -0.038815
H  6.997402 -1.135779 1.223315
H  6.733105 0.485979 0.59426
H  6.435193 0.142559 2.294862
H  -3.902042 2.274528 -1.491411
H  -3.722877 2.414726 1.115944
elementType: S O N C H
totalener: -958.86446396 hartree
nucrepener: 999.27293403 hartree
electener: -1958.13739799 hartree
oneelecener: -3292.95390419 hartree
twoeener: 1334.81650619 hartree
cpcmener: -0.02069610 hartree
kineticenergy: 955.51527354 hartree
xcener: -75.345303375786 hartree
chargesum: -0.0000000
charge: 0.114441 -0.546644 -0.078157 -0.138298 -0.121667 -0.109055 -0.121622 -0.143928 -0.098119 -0.074338 -0.284716 0.309667 -0.263934 -0.066146 0.076320 0.063823 0.083450 0.061278 0.060153 0.069896 0.072075 0.081818 0.069165 0.060020 0.130825 0.103727 0.055159 0.057386 0.090111 0.078288 0.077552 0.158547 0.172924
qa: 0.1144 -0.5466 -0.0782 -0.1383 -0.1217 -0.1091 -0.1216 -0.1439 -0.0981 -0.0743 -0.2847 0.3097 -0.2639 -0.0661 0.0763 0.0638 0.0834 0.0613 0.0602 0.0699 0.0721 0.0818 0.0692 0.0600 0.1308 0.1037 0.0552 0.0574 0.0901 0.0783 0.0776 0.1585 0.1729
va: 2.5591 1.9668 3.0619 3.9014 3.8656 3.8747 3.8464 3.9079 3.8266 3.8518 3.9505 4.2105 3.9149 3.9966 1.0078 1.0078 1.0174 1.0167 1.0095 1.0116 1.0066 1.0193 1.0095 1.0083 1.0008 1.0282 1.0061 1.0080 1.0036 1.0002 1.0016 0.9989 0.9856
dispcorr: -0.012989541 hartree
energy: -958.877453503597
dipole: 35.36776 -35.15243 0.21533 -3.54685 3.78258 0.23573 4.43896 -2.37630 2.06266
magnitude: 2.08722 au
magnitude: 5.30529 debye
